program: Gaussian 09
title: 000242474
version: EM64L-G09RevD.01
frameworkgroup: C1[X(C17H16N2O2)]
method: RPBEPBE
basis: SDD
operation: Freq
keyword: #p
keyword: freq=noraman
keyword: PBEPBE/SDD
title: #p freq=noraman PBEPBE/SDD
converged: YES YES NO NO
title: Mulliken charges:
elementType: O O N N C C C C C C C C C C C C C C C C C H H H H H H H H H H H H H H H H
charge: -0.217543 -0.226894 -0.438617 -0.397682 0.064961 -0.618471 0.455309 0.177243 0.502146 0.149949 -0.372647 -0.397580 -0.379123 -0.451610 -0.249782 -0.227251 -0.390013 -0.393203 0.435474 -0.238677 -0.804175 0.248821 0.226170 0.347243 0.349568 0.265180 0.243099 0.249438 0.245834 0.229227 0.228295 0.231638 0.232920 0.231131 0.226736 0.236529 0.226356
chargesum: 0.00000
title: Mulliken charges with hydrogens summed into heavy atoms:
elementType: O O N N C C C C C C C C C C C C C C C C C
charge: -0.217543 -0.226894 -0.091374 -0.048114 0.064961 -0.143479 0.455309 0.177243 0.502146 0.149949 -0.107466 -0.154481 -0.129685 -0.205776 -0.020555 0.001044 -0.158375 -0.160283 0.435474 -0.007545 -0.114554
polarizability: 2.02922143e+02 4.32446575e+00 2.20230718e+02 2.60878558e+01 -1.15619598e+01 1.57181442e+02
1716.lowfreq: -17.8234 -3.9417 -0.0008 -0.0005 -0.0004 4.1155 9.2982 26.9405 39.8121
frequency: -17.7717 26.8696 39.7965 50.1334 56.7697 60.6226 104.8272 131.9612 155.3668 162.7679 184.4546 239.6902 278.3806 304.1931 333.8247 339.5895 384.7472 392.8060 403.7463 409.8295 469.2354 472.4535 509.1645 513.9743 565.9207 604.0131 613.8770 616.1313 639.1621 646.4221 651.4934 688.1641 705.3400 720.8783 724.4648 742.3826 757.0891 776.9683 822.8454 831.2812 854.2499 858.2430 879.0061 921.4322 958.5570 967.4900 973.1289 978.6629 980.9306 990.1234 996.0339 997.1613 1011.6263 1016.0033 1032.5682 1048.4963 1076.3089 1105.3953 1127.4407 1163.2799 1174.6755 1195.0324 1196.5023 1198.1396 1216.4808 1225.3313 1254.9112 1301.2164 1309.3774 1317.1958 1321.6601 1325.5920 1357.8787 1376.2363 1381.9313 1398.7451 1408.5616 1435.4474 1465.4125 1472.0612 1473.4920 1482.3927 1508.9973 1581.8695 1592.0812 1610.7199 1624.0957 1677.8464 1721.3995 2975.9713 3009.5148 3057.4428 3074.9312 3086.3395 3111.3728 3120.7805 3126.5629 3135.5627 3136.1862 3147.2946 3148.4514 3156.5619 3167.8651 3583.3980 3586.1470
redmass: 1.0113 4.9424 4.7130 4.9236 4.1509 5.4082 5.7350 5.3057 4.6722 8.1680 5.4801 4.7515 4.9854 4.0609 3.2475 5.4613 9.1576 2.1717 2.8246 2.8219 2.7884 4.4215 3.3100 1.2748 4.0400 9.7611 4.2285 5.6036 6.0138 3.2487 1.5703 5.5850 1.8208 4.0326 5.7951 2.7819 3.6405 2.3040 2.6378 2.2236 1.2549 1.2447 2.5099 1.4341 1.3576 2.7717 2.4214 1.4121 1.3870 4.4578 1.6521 1.4567 4.4396 3.1562 2.1381 1.5611 2.0508 1.9329 1.4366 1.8206 1.0579 1.3026 1.1110 2.6542 4.5498 2.2998 2.0906 2.3063 1.6256 1.6116 1.3291 1.9569 1.7392 4.8162 7.7607 1.2230 2.6757 2.2380 1.1016 1.0949 1.0560 2.1923 2.6832 5.9133 6.1426 6.0159 6.3821 8.7517 9.4939 1.0387 1.0619 1.0949 1.1007 1.0998 1.0874 1.0879 1.0847 1.0881 1.0959 1.0968 1.0923 1.0956 1.1011 1.0790 1.0810
irintensity: 0.5134 0.0656 0.0495 0.0152 0.0147 0.1828 0.6350 3.1790 0.3608 3.2447 1.3334 0.2148 4.2330 0.7130 0.1043 0.1695 16.3816 0.0500 0.2640 0.2377 37.6970 5.5663 7.0107 78.7696 7.1006 13.2581 9.7761 4.7015 3.3549 79.6630 114.2719 0.4642 57.2022 32.9287 30.6263 5.7519 8.1442 23.8481 16.5685 18.0955 0.1517 0.5680 17.8313 2.3397 2.0162 7.1573 16.2425 0.6716 0.4892 0.6037 2.0454 0.5763 18.5113 1.9179 6.3704 14.9250 9.4427 4.6250 8.7622 7.1638 0.4121 6.8535 3.2167 57.4961 10.6873 1.1063 38.4607 180.8291 27.5687 28.3636 3.9041 66.8754 9.3655 1.6649 1.2747 11.8324 2.0490 17.1473 12.5249 15.2892 14.0206 16.7451 33.7095 0.2618 0.1372 4.2509 3.5548 467.0127 492.8308 34.3724 19.6662 23.0882 9.9797 17.1965 12.0493 14.1529 0.5155 8.6584 26.3675 5.6265 16.5368 20.1990 17.3123 76.2759 55.0628
temp: 298.150 k
press: 1.00000 atm
elementType: 8 8 7 7 6 6 6 6 6 6 6 6 6 6 6 6 6 6 6 6 6 1 1 1 1 1 1 1 1 1 1 1 1 1 1 1 1
symmnumber: 1
zpe: 767389.1 jmol-1
zpe.correction: 0.292283 hartree
zpe.thermalcorrener: 0.309793 hartree
zpe.thermalcorrenthalpy: 0.310737 hartree
zpe.thermalcorrgfe: 0.245451 hartree
zpe.sumelectzpe: -915.927743 hartree
zpe.sumelectthermal: -915.910234 hartree
zpe.sumelectthermalent: -915.909289 hartree
zpe.sumelectthermalfe: -915.974576 hartree
dipole: 3.2008 2.2329 0.0393
dipole: 3.9029
quadrupole: -119.0769 -119.2263 -128.7781
quadrupole: -2.8719 3.2836 7.9650
quadrupole: 3.2835 3.1342 -6.4177 -2.8719 3.2836 7.9650
hfenergy: -916.2200264 hartree
pointgroup: C01 [X(C17H16N2O2)]
dipole: -1.289596 -0.8334966 0.0089507 debye
polarizability: 202.0054271|6.4309308|218.661942|-26.461942|15.0820014|159.6669338 unknown
InChI: InChI=1S/C17H16N2O2/c1-12-7-9-13(10-8-12)11-17(14-5-3-2-4-6-14)15(20)18-16(21)19-17/h2-10,18-19H,11H2,1H3
charge 0 multiplicity 1
37 atoms
O  3.076744 0.563196 -1.886638
O  2.114176 3.118199 1.955282
N  0.935224 1.35886 0.859905
N  2.933022 1.94654 0.034807
C  1.104597 0.483917 -0.313609
C  0.003899 0.784314 -1.403488
C  1.170874 -1.014449 0.043476
C  2.493404 0.965002 -0.853142
C  -1.411386 0.616109 -0.873603
C  1.986502 2.238771 1.072483
C  1.485103 -1.960545 -0.967236
C  0.922408 -1.470199 1.359447
C  -2.048257 -0.651863 -0.85373
C  -2.13008 1.731176 -0.368669
C  1.533494 -3.338044 -0.664599
C  0.966171 -2.850965 1.66011
C  -3.35564 -0.796723 -0.342972
C  -3.438246 1.582476 0.144575
C  -4.073188 0.314611 0.171532
C  1.2672 -3.790569 0.649347
C  -5.469581 0.148546 0.745903
H  0.196524 0.11541 -2.260094
H  0.158153 1.82118 -1.756502
H  0.053224 1.448243 1.363152
H  3.817271 2.44904 -0.047023
H  1.725211 -1.616985 -1.979098
H  0.707099 -0.749349 2.154528
H  -1.517379 -1.528731 -1.241758
H  -1.670948 2.727657 -0.398962
H  1.785922 -4.056815 -1.4521
H  0.768531 -3.189285 2.68337
H  -3.82873 -1.786329 -0.34562
H  -3.975504 2.462187 0.519535
H  1.302782 -4.860474 0.882859
H  -6.017439 -0.671256 0.248776
H  -5.428813 -0.092343 1.826117
H  -6.064742 1.072291 0.638334
