program: Gaussian 09
title: 000242473
version: EM64L-G09RevD.01
frameworkgroup: C1[X(C15H14O)]
method: RPBEPBE
basis: SDD
operation: Freq
keyword: #pfreq=noraman
keyword: PBEPBE/SDD
title: #p freq=noraman PBEPBE/SDD
converged: YES YES NO NO
title: Mulliken charges:
elementType: O C C C C C C C C C C C C C C C H H H H H H H H H H H H H H
charge: -0.222628 -0.677438 0.505156 0.124959 -0.383302 -0.438138 0.433919 0.302333 -0.347965 -0.419195 -0.345641 -0.353941 -0.807059 -0.244724 -0.230624 -0.224806 0.258472 0.223001 0.254684 0.228167 0.229101 0.229407 0.247054 0.277788 0.222947 0.231490 0.230991 0.230240 0.232920 0.232830
chargesum: 0.00000
title: Mulliken charges with hydrogens summed into heavy atoms:
elementType: O C C C C C C C C C C C C C C C
charge: -0.222628 -0.195965 0.505156 0.124959 -0.128618 -0.209971 0.433919 0.302333 -0.118864 -0.189787 -0.098587 -0.076153 -0.121631 -0.014484 0.002296 0.008024
polarizability: 1.92332457e+02 4.90724826e+00 1.57253973e+02 -6.75797907e+00 -1.52808859e+01 1.27582992e+02
1716.lowfreq: -35.8206 -11.7903 -3.8779 -0.0006 -0.0005 0.0005 1.6579 21.9729 30.3618
frequency: -35.5045 21.3480 30.1042 46.8174 84.6289 126.9788 151.1674 204.1822 264.1613 298.6079 358.2126 376.2837 399.3058 406.7784 414.7358 452.8724 473.1081 508.7574 574.4416 613.2735 638.6105 666.0178 694.9302 708.7248 740.1079 748.5503 795.0446 813.7963 847.4642 853.5879 857.8380 929.2502 945.9360 953.8924 978.2689 987.6325 988.9880 991.4977 1010.5730 1012.8355 1017.1309 1042.3814 1048.0097 1085.2491 1119.6267 1155.2117 1173.7516 1188.1960 1194.4548 1202.6405 1222.6444 1270.1777 1283.2355 1316.2824 1318.6219 1373.7394 1387.4610 1398.4758 1408.4034 1434.9508 1458.3783 1470.1931 1475.5353 1479.6362 1506.9669 1563.0515 1584.2073 1596.5450 1610.2571 1624.8472 2976.2876 3003.2643 3054.4268 3063.4244 3083.1020 3105.7242 3115.4722 3128.1526 3133.2868 3139.9616 3141.8630 3152.3546 3162.4806 3171.5544
redmass: 1.0320 4.9127 3.8959 3.8612 5.7502 4.7083 4.7149 4.3104 3.3774 4.3431 3.3965 2.8298 2.8757 2.8990 4.0091 4.1354 3.7048 2.8837 4.2984 6.4299 6.6709 5.0398 1.8040 3.2836 3.5692 2.3583 2.2800 2.1112 2.4116 1.3100 1.2647 2.0225 1.4918 1.4275 1.3772 1.5647 1.9106 2.3702 1.3672 2.9477 3.0286 2.1117 1.5586 1.5803 1.3637 1.2707 1.0610 1.1188 1.1623 2.9284 2.7562 2.0403 1.8605 1.3000 1.3504 5.0407 9.2289 1.2564 2.7674 2.2469 1.1357 1.0459 1.1019 2.1158 2.6007 7.7397 5.9949 6.7044 6.2290 6.4084 1.0372 1.0587 1.0976 1.1025 1.0987 1.0877 1.0877 1.0852 1.0956 1.0886 1.0969 1.0928 1.0958 1.0998
irintensity: 0.4741 1.1968 0.0602 0.1398 2.6017 0.9271 0.0753 4.1042 3.3805 0.5472 1.1726 0.1524 0.0468 0.0076 0.5595 1.7507 4.8065 12.8051 41.9782 0.6226 1.5740 16.2208 54.8564 8.0440 15.9619 31.6092 34.6681 20.5608 2.3647 1.4737 0.5633 8.7446 5.6521 2.4864 0.1601 2.1800 2.4110 0.2496 0.6671 20.0295 9.6689 5.5482 13.6725 8.1393 9.2670 43.1898 0.1462 15.5459 0.7619 1.8618 1.3344 117.0704 82.8588 3.4772 13.5391 0.6666 2.4834 10.4048 3.0655 18.1925 19.2451 12.8093 13.6239 2.5712 43.3517 125.3320 1.3024 37.4911 12.1632 3.4869 38.5455 17.4631 21.0908 10.5051 19.7623 16.4155 15.3802 0.2788 31.3769 9.3752 2.1559 13.8430 27.6409 13.7115
temp: 298.150 k
press: 1.00000 atm
elementType: 8 6 6 6 6 6 6 6 6 6 6 6 6 6 6 6 1 1 1 1 1 1 1 1 1 1 1 1 1 1
symmnumber: 1
zpe: 636478.7 jmol-1
zpe.correction: 0.242422 hartree
zpe.thermalcorrener: 0.255819 hartree
zpe.thermalcorrenthalpy: 0.256763 hartree
zpe.thermalcorrgfe: 0.200088 hartree
zpe.sumelectzpe: -654.101050 hartree
zpe.sumelectthermal: -654.087653 hartree
zpe.sumelectthermalent: -654.086709 hartree
zpe.sumelectthermalfe: -654.143384 hartree
dipole: -0.5393 -3.3476 0.7947
dipole: 3.4826
quadrupole: -83.2364 -97.3526 -88.6564
quadrupole: -4.0762 -0.0138 -0.9356
quadrupole: 6.5120 -7.6041 1.0921 -4.0762 -0.0138 -0.9356
hfenergy: -654.3434721 hartree
pointgroup: C01 [X(C15H14O1)]
dipole: 0.0659994 -0.028664 1.3682875 debye
polarizability: 189.8250324|-8.9332368|123.4204617|8.7261042|-8.8152404|163.9239272 unknown
InChI: InChI=1S/C15H14O/c1-12-7-9-13(10-8-12)11-15(16)14-5-3-2-4-6-14/h2-10H,11H2,1H3
charge 0 multiplicity 1
30 atoms
O  -1.08804 -0.262945 -2.986658
C  0.091012 -1.672699 -1.402585
C  1.274732 -1.017579 -0.685986
C  -1.003499 -0.663441 -1.786846
C  1.898012 0.135713 -1.229757
C  1.795185 -1.558517 0.513973
C  3.533216 0.186299 0.616198
C  -1.949678 -0.149505 -0.738998
C  3.005607 0.725389 -0.587418
C  2.909165 -0.966747 1.152855
C  -1.858931 -0.524402 0.628551
C  -2.978857 0.744618 -1.144677
C  4.730225 0.82726 1.297854
C  -2.781237 -0.017252 1.568872
C  -3.899892 1.248652 -0.206513
C  -3.803976 0.867546 1.154516
H  0.431919 -2.125897 -2.351287
H  -0.326151 -2.479845 -0.773083
H  1.51272 0.568776 -2.160613
H  1.337195 -2.456732 0.948597
H  3.471016 1.617199 -1.025887
H  3.29817 -1.40791 2.078655
H  -1.061903 -1.193812 0.965712
H  -3.030184 1.023502 -2.202469
H  5.001097 0.294418 2.225698
H  5.617687 0.824867 0.637112
H  4.525818 1.881878 1.562015
H  -2.702477 -0.307518 2.622226
H  -4.690844 1.934844 -0.528476
H  -4.520005 1.258644 1.886217
