program: Gaussian 09
title: 000242469
version: EM64L-G09RevD.01
frameworkgroup: C1[X(C21H32O)]
method: RPBEPBE
basis: SDD
operation: Freq
keyword: #pfreq=noraman
keyword: PBEPBE/SDD
title: #p freq=noraman PBEPBE/SDD
converged: YES YES NO NO
title: Mulliken charges:
elementType: O C C C C C C C C C C C C C C C C C C C C C H H H H H H H H H H H H H H H H H H H H H H H H H H H H H H H H
charge: -0.442581 -0.373876 -0.364522 -0.368846 -0.390965 -0.390320 -0.566964 -0.475578 0.568193 -0.176810 -0.598286 -0.449245 -0.170785 -0.529927 0.306686 -0.193181 -0.373313 -0.177158 -0.430246 -0.176878 -0.347629 -0.687739 0.189942 0.191401 0.193010 0.191346 0.185244 0.217716 0.212281 0.208411 0.193559 0.200556 0.202877 0.206506 0.200960 0.204746 0.219985 0.224072 0.232841 0.220138 0.205045 0.208236 0.223237 0.250827 0.221090 0.192332 0.200315 0.220342 0.194980 0.211061 0.216029 0.211384 0.208661 0.350841
chargesum: 0.00000
title: Mulliken charges with hydrogens summed into heavy atoms:
elementType: O C C C C C C C C C C C C C C C C C C C C C
charge: -0.091740 0.007468 0.019834 0.034115 0.029727 0.003796 -0.157581 -0.069873 0.568193 0.043175 -0.374215 -0.216405 0.049353 -0.116646 0.306686 0.030056 -0.122487 0.043932 -0.037599 0.043464 0.058412 -0.051666
polarizability: 2.70627036e+02 -7.92528367e+00 2.35987709e+02 -9.64829453e+00 1.91178813e+01 1.92009571e+02
1716.lowfreq: -1.8998 -0.0004 0.0007 0.0008 2.8599 7.4025 8.8211 11.1395 19.4608
frequency: 6.8726 10.0557 19.2359 22.4024 28.0560 41.7502 57.1994 67.5832 76.1802 78.6432 99.6689 107.2646 127.4841 133.7086 150.7537 167.4332 194.4304 200.0947 215.8934 223.1253 230.7781 258.2639 284.0977 289.1771 312.0951 337.8583 350.7667 384.5579 406.6221 421.5384 423.9905 452.8863 481.6748 498.0496 516.2020 531.2431 559.7922 621.1201 696.4697 722.6474 735.7333 739.4235 739.7283 767.6731 780.8033 793.5714 797.5353 846.0411 853.2426 855.8386 867.2779 885.1633 890.0755 918.8066 926.8521 941.0246 965.3278 972.1425 977.3563 982.9458 984.9522 994.0676 1002.3604 1015.1159 1039.1681 1045.5990 1058.1996 1064.9978 1072.3669 1076.1006 1078.9717 1091.7912 1096.2071 1101.9728 1116.6869 1135.6029 1160.7547 1171.0933 1175.5895 1178.7400 1193.4613 1212.7206 1222.7413 1230.0494 1248.5892 1256.4848 1267.8221 1268.6566 1277.0431 1277.9907 1283.1630 1289.0258 1289.8638 1294.1232 1297.2936 1300.7492 1312.3187 1318.3544 1321.0892 1336.5808 1339.0346 1347.1280 1352.5246 1358.2780 1387.2498 1392.9851 1440.9726 1451.7549 1458.0060 1460.4832 1461.1844 1461.9619 1465.2935 1471.3362 1473.1234 1477.1252 1481.7024 1485.7749 1487.9954 1492.9349 1610.3519 1614.2757 1680.8869 1688.2985 2938.6021 2949.4314 2951.5594 2952.3181 2953.6398 2960.0828 2965.8224 2968.8209 2971.8139 2975.1656 2978.6345 2985.9157 2998.8214 3008.1336 3008.2241 3018.0395 3023.5167 3028.9621 3033.7687 3038.8125 3049.1130 3062.1521 3063.6940 3069.7232 3071.7434 3072.5253 3079.7421 3096.2580 3123.9005 3146.0301 3173.8050 3581.1516
redmass: 4.7027 4.2065 4.3141 3.4094 3.9529 4.0376 2.4790 1.8847 2.0206 2.7594 2.9353 3.2355 2.2482 1.9315 2.0403 2.6150 3.2871 2.9690 2.7457 3.9294 1.1247 3.1137 2.8144 2.8276 2.6536 3.5044 1.1247 3.3209 3.1189 2.4476 3.1145 2.9140 2.7128 2.3192 7.4308 2.7346 4.3826 4.7500 2.1441 1.0715 1.1219 2.0030 1.6242 1.2854 1.5582 1.4699 1.4742 1.7616 1.5966 1.4696 1.5024 1.7776 1.4133 1.9741 2.5785 1.8411 1.3725 1.3305 1.2774 1.5538 6.0297 1.6894 3.2049 1.8979 2.4756 3.0150 2.7569 1.5771 1.9062 2.4162 2.4802 2.1893 2.0952 1.4051 1.8797 1.5299 2.1438 1.0884 1.4387 1.3631 1.2924 1.4482 1.3243 1.2966 1.2876 1.3329 1.3113 1.5218 1.6579 1.1629 1.1487 1.1812 1.2939 1.1611 1.1588 1.2029 1.3819 1.3267 1.3239 1.4213 1.4580 1.5011 1.5848 1.5765 1.2132 6.7863 2.8105 1.0915 1.0930 1.0842 1.0782 1.0751 1.0733 1.0998 1.0606 1.0436 1.1033 1.0761 1.1025 2.6137 6.3339 6.4061 6.4372 6.7006 1.0652 1.0587 1.0616 1.0596 1.0596 1.0618 1.0605 1.0590 1.0363 1.0603 1.0594 1.0965 1.0977 1.0957 1.1008 1.1000 1.1021 1.0931 1.1015 1.1041 1.1046 1.0934 1.0936 1.0986 1.0961 1.0926 1.0885 1.0910 1.0871 1.0938 1.0969 1.0659
irintensity: 0.1218 0.0626 0.1086 0.1055 0.0994 0.2678 0.0909 0.0042 0.0590 0.0354 0.1394 0.0311 0.0883 0.0660 0.1210 0.1663 0.2676 0.3306 0.3467 1.1959 0.0403 2.0631 2.0718 1.2646 0.9793 2.8763 141.5909 0.9502 1.5036 1.4061 13.2749 11.1347 3.1939 1.9919 2.4802 0.3157 1.5374 0.0021 28.3088 10.6100 0.3009 5.4895 17.2056 2.5235 0.7952 21.0477 18.6912 1.7840 23.0906 2.7795 4.2477 4.7541 0.7739 0.9957 21.1659 2.3785 17.3128 0.8546 62.4290 34.4830 1.4154 4.1653 6.3125 5.4953 4.6697 1.3850 3.7905 18.8311 14.8788 1.6863 1.2090 4.0825 5.3251 19.1863 0.7091 200.2533 2.5205 0.7536 3.6400 8.9485 4.9580 4.4283 0.0887 6.2218 1.6385 0.5963 0.4215 6.1940 8.2777 0.0114 0.8371 0.5823 1.5663 0.0722 1.3344 1.0611 1.9235 6.7777 1.1596 1.6863 0.2917 0.7225 0.1913 2.7934 10.8206 6.6747 54.3027 14.1537 13.2689 3.2081 0.3565 0.3229 1.2014 0.7400 2.8535 11.8211 0.7420 15.0532 23.1166 14.5392 104.9448 26.1913 0.0781 0.1673 41.5621 0.5774 34.9509 17.6668 12.7206 27.0653 73.2173 38.5535 54.0073 31.7416 93.5568 0.3017 8.7495 3.1877 10.5321 17.1781 6.4258 8.3162 16.6894 48.1749 139.3332 8.6040 13.2647 81.8996 33.4725 26.9446 114.6492 19.5402 9.1977 20.0363 10.2587 28.3073
temp: 298.150 k
press: 1.00000 atm
elementType: 8 6 6 6 6 6 6 6 6 6 6 6 6 6 6 6 6 6 6 6 6 6 1 1 1 1 1 1 1 1 1 1 1 1 1 1 1 1 1 1 1 1 1 1 1 1 1 1 1 1 1 1 1 1
symmnumber: 1
zpe: 1243178.8 jmol-1
zpe.correction: 0.473502 hartree
zpe.thermalcorrener: 0.499287 hartree
zpe.thermalcorrenthalpy: 0.500231 hartree
zpe.thermalcorrgfe: 0.410882 hartree
zpe.sumelectzpe: -892.908278 hartree
zpe.sumelectthermal: -892.882493 hartree
zpe.sumelectthermalent: -892.881549 hartree
zpe.sumelectthermalfe: -892.970897 hartree
dipole: 2.0302 0.1915 0.0733
dipole: 2.0405
quadrupole: -161.0240 -132.8781 -130.4324
quadrupole: 3.5569 2.4147 6.5706
quadrupole: -19.5791 8.5667 11.0125 3.5569 2.4147 6.5706
hfenergy: -893.3817798 hartree
pointgroup: C01 [X(C21H32O1)]
dipole: 0.7961423 -0.0984629 -0.0311872 debye
polarizability: 271.0484476|6.4829921|234.205935|10.5506271|20.2651316|193.3699337 unknown
InChI: InChI=1S/C21H32O/c1-2-3-4-5-6-7-8-9-10-11-12-13-14-16-20-17-15-18-21(22)19-20/h4-5,7-8,15,17-19,22H,2-3,6,9-14,16H2,1H3
charge 0 multiplicity 1
54 atoms
O  -6.766772 -1.40278 -1.972415
C  0.173683 2.260393 -0.100962
C  -0.601234 1.113003 0.585889
C  1.671198 2.295858 0.277418
C  -2.10373 1.095832 0.228488
C  2.44373 3.441389 -0.413081
C  -2.874446 -0.066606 0.915315
C  3.95503 3.477801 -0.047859
C  -4.360839 -0.058235 0.589573
C  4.722467 2.277281 -0.564834
C  -4.854617 -0.764215 -0.536384
C  -5.272934 0.689915 1.377339
C  5.417956 1.396671 0.200066
C  6.182061 0.19203 -0.328479
C  -6.229799 -0.716272 -0.865606
C  -6.645997 0.731049 1.040429
C  -7.136816 0.031238 -0.081235
C  5.694144 -1.115981 0.276341
C  4.730342 -3.477451 0.167869
C  5.226402 -2.177452 -0.430463
C  3.254991 -3.790587 -0.204345
C  2.77789 -5.14665 0.358391
H  -0.297268 3.230256 0.164749
H  0.075761 2.160212 -1.202419
H  -0.142771 0.141608 0.304454
H  -0.487403 1.201626 1.686917
H  1.769068 2.403607 1.378477
H  2.14495 1.327776 0.018624
H  -2.567816 2.058954 0.521878
H  -2.227105 1.013997 -0.87046
H  2.337356 3.34496 -1.513971
H  1.983937 4.412926 -0.138617
H  -2.418427 -1.026818 0.602076
H  -2.729088 0.014316 2.010584
H  4.066849 3.547489 1.052595
H  4.395365 4.404094 -0.473314
H  4.69306 2.12303 -1.656512
H  -4.160599 -1.354265 -1.15245
H  -4.907005 1.23432 2.255868
H  5.438688 1.541169 1.292471
H  6.105969 0.149869 -1.431548
H  7.260186 0.317522 -0.08508
H  -7.342864 1.308952 1.657882
H  -8.195232 0.047155 -0.356887
H  5.726905 -1.181353 1.376125
H  5.361988 -4.319591 -0.18822
H  4.833633 -3.448589 1.270764
H  5.185946 -2.105932 -1.530159
H  3.15104 -3.787394 -1.308448
H  2.608311 -2.974424 0.173202
H  1.72621 -5.350402 0.085105
H  2.849749 -5.165621 1.46227
H  3.396006 -5.977533 -0.031622
H  -6.058109 -1.896146 -2.455389
