program: Gaussian 09
title: 000242468
version: EM64L-G09RevD.01
frameworkgroup: C1[X(C21H34O)]
method: RPBEPBE
basis: SDD
operation: Freq
keyword: #pfreq=noraman
keyword: PBEPBE/SDD
title: #p freq=noraman PBEPBE/SDD
converged: YES YES NO NO
title: Mulliken charges:
elementType: O C C C C C C C C C C C C C C C C C C C C C H H H H H H H H H H H H H H H H H H H H H H H H H H H H H H H H H H
charge: -0.451751 -0.369765 -0.361574 -0.362835 -0.390583 -0.390497 -0.480897 -0.571457 -0.406822 -0.348472 -0.469515 -0.362840 -0.182638 0.557268 -0.176601 -0.356192 -0.584809 -0.449370 -0.698251 0.308064 -0.190283 -0.377616 0.193543 0.181898 0.185218 0.207425 0.214038 0.180296 0.198830 0.196371 0.198708 0.211367 0.200879 0.205046 0.199774 0.209750 0.196396 0.196612 0.206157 0.179028 0.199381 0.210655 0.185186 0.201023 0.218526 0.220569 0.169452 0.194081 0.231623 0.232907 0.205453 0.248795 0.205413 0.223807 0.252472 0.356755
chargesum: 0.00000
title: Mulliken charges with hydrogens summed into heavy atoms:
elementType: O C C C C C C C C C C C C C C C C C C C C C
charge: -0.094996 0.005676 0.031069 0.031500 0.004618 0.019579 -0.074972 -0.161933 -0.013814 0.036713 -0.059479 0.023369 0.035889 0.557268 0.043968 0.007341 -0.353186 -0.216463 -0.038589 0.308064 0.033523 -0.125144
polarizability: 2.47639319e+02 -6.43398365e+00 2.53716478e+02 -2.58119545e+01 2.92386649e+00 1.84741898e+02
1716.lowfreq: -6.9417 -6.6269 -0.0007 -0.0006 -0.0001 4.8918 10.1243 16.9708 21.6411
frequency: 9.8240 16.9035 21.5394 28.7869 38.0671 55.2648 63.6766 73.2045 82.1177 89.6183 95.7997 110.7575 125.4279 131.4007 155.7443 164.9547 189.4216 197.2491 223.2734 225.2137 237.4772 239.9195 284.0425 292.9373 319.3900 371.1217 383.2389 388.9904 400.4434 416.1090 426.5466 449.2144 460.5253 490.6964 506.4458 511.5703 522.7300 619.8046 697.8951 711.5246 721.1156 725.8182 742.3768 757.0724 776.7345 794.4097 814.1971 834.5078 837.3070 856.4761 866.2451 873.5610 889.5080 891.1724 895.1570 915.4339 927.0735 958.3761 971.7158 971.9642 978.2775 985.1588 996.3341 1004.6833 1026.9459 1034.9714 1045.7356 1060.5076 1066.1916 1071.6341 1082.5605 1089.0853 1096.9897 1103.2680 1107.9887 1120.0875 1137.6507 1147.8798 1167.6597 1171.7088 1181.8299 1183.4884 1203.1046 1205.7979 1229.1264 1244.8799 1245.7555 1260.0529 1267.3079 1269.9203 1280.4850 1281.7071 1284.1879 1288.1774 1291.8232 1293.5666 1294.9802 1313.1328 1315.0581 1320.9946 1331.8389 1335.4421 1342.0847 1348.7145 1354.9260 1355.7711 1357.5293 1391.5570 1392.4219 1438.9898 1455.9200 1459.1878 1459.3565 1461.8525 1462.9487 1463.6291 1465.9105 1467.6754 1473.8957 1475.1390 1476.8320 1481.9959 1485.0416 1487.6708 1492.6640 1608.7655 1613.4240 1683.2519 2935.6595 2949.3601 2950.6498 2952.4192 2952.7279 2955.5239 2957.9965 2962.5951 2964.7297 2967.1248 2970.1172 2974.6890 2977.8020 2981.1254 2987.7261 2998.4359 3001.3913 3009.7376 3012.3928 3017.9185 3029.9593 3030.5785 3034.7479 3036.8097 3042.7689 3055.1047 3064.9394 3067.5050 3081.0994 3102.9795 3123.8313 3145.7184 3172.8067 3574.6094
redmass: 3.8126 3.9726 3.9854 4.5620 4.3935 3.5813 3.2565 2.1723 1.7910 2.2485 2.9707 2.5059 2.7008 2.0773 2.7074 2.4173 2.4194 3.7030 1.8460 3.8600 1.8451 1.5647 2.7629 2.4451 3.1170 1.1441 2.9195 2.8711 2.2727 2.9581 2.7319 2.9337 2.6213 2.2093 2.5644 4.4076 5.7077 3.5048 2.1239 2.7850 1.1533 1.1289 1.2724 1.2481 1.3899 1.4427 1.4797 1.8045 1.7313 1.7470 1.6934 2.2392 1.7187 1.5948 2.0339 1.7099 1.9058 1.4472 1.6178 1.3277 1.4113 6.2381 2.1676 1.9888 2.2321 2.0386 1.9639 2.4188 2.4135 1.9846 1.7563 2.2806 1.6236 1.5554 2.0890 1.9532 1.5483 2.0122 1.1947 1.1256 1.3651 1.4846 1.3779 1.4852 1.3669 1.3011 1.2980 1.3063 2.3083 1.3011 1.1922 1.1380 1.1896 1.1633 1.1344 1.1372 1.2197 1.3330 1.3525 1.4276 1.4347 1.4180 1.4606 1.4308 1.6315 1.5439 1.5322 1.2153 6.3699 2.6986 1.0848 1.0925 1.0775 1.0860 1.0765 1.0780 1.0936 1.0725 1.0977 1.1094 1.0702 1.0484 1.1018 1.0826 2.5304 6.2577 6.3883 6.5895 1.0593 1.0598 1.0594 1.0601 1.0602 1.0608 1.0613 1.0626 1.0604 1.0607 1.0624 1.0365 1.0622 1.0947 1.0944 1.0976 1.0991 1.1000 1.1002 1.1005 1.0996 1.0995 1.1037 1.1021 1.1040 1.0943 1.0878 1.1000 1.0995 1.0912 1.0870 1.0937 1.0970 1.0660
irintensity: 0.0859 0.3173 0.3734 0.0300 0.0438 0.2268 0.1407 0.0933 0.1968 0.0930 0.1116 0.0209 0.7397 0.0511 0.0559 0.2794 0.3766 0.0718 1.7319 0.6685 0.0744 1.5150 0.1699 1.8675 0.6711 220.6487 1.1644 1.2881 0.5188 10.2863 7.8442 6.0887 5.4799 1.0635 1.9596 0.5851 3.9462 0.0852 29.8004 6.2687 16.8655 8.2979 3.6715 5.7593 7.0300 30.2810 7.2459 1.9557 4.5978 7.9761 26.5517 0.5516 5.4262 6.9642 5.4214 2.6642 8.7484 4.5518 26.0801 2.1004 37.2758 1.4327 2.3775 2.8779 3.7580 2.3014 1.8442 1.8227 0.6585 6.7899 23.8935 3.3139 14.7637 5.5555 0.6426 3.8199 152.2298 3.6307 4.5010 2.9739 4.4086 6.2430 2.3527 0.3828 2.3746 0.2986 1.2664 1.3114 20.4863 2.9882 0.4041 0.3349 1.3876 0.4074 0.8793 4.3230 0.8415 3.5226 3.9953 1.2935 0.3210 1.4379 0.3695 1.8127 3.6744 3.4129 2.8772 13.9506 5.0309 57.4522 12.3096 1.4305 8.9903 1.2670 1.3537 11.9256 6.3686 1.6041 1.3241 10.3855 1.8592 13.1729 13.1122 11.6088 11.8074 87.4778 22.1498 0.0190 49.6496 2.7452 9.1285 11.8029 9.1785 14.2450 26.5239 101.4515 14.9794 172.1329 45.9525 34.0986 35.7733 21.0932 4.8978 5.9502 5.8484 18.1883 12.5140 17.6233 23.3880 13.4159 139.3560 38.1983 169.0819 1.7169 99.5188 69.3518 32.0482 19.1283 7.9632 21.6678 9.4621 35.4269
temp: 298.150 k
press: 1.00000 atm
elementType: 8 6 6 6 6 6 6 6 6 6 6 6 6 6 6 6 6 6 6 6 6 6 1 1 1 1 1 1 1 1 1 1 1 1 1 1 1 1 1 1 1 1 1 1 1 1 1 1 1 1 1 1 1 1 1 1
symmnumber: 1
zpe: 1305531.4 jmol-1
zpe.correction: 0.497251 hartree
zpe.thermalcorrener: 0.523014 hartree
zpe.thermalcorrenthalpy: 0.523958 hartree
zpe.thermalcorrgfe: 0.437074 hartree
zpe.sumelectzpe: -894.105144 hartree
zpe.sumelectthermal: -894.079381 hartree
zpe.sumelectthermalent: -894.078437 hartree
zpe.sumelectthermalfe: -894.165321 hartree
dipole: 1.2332 1.4594 -0.7517
dipole: 2.0532
quadrupole: -144.8368 -136.4794 -134.7233
quadrupole: -8.3877 -4.1017 0.5769
quadrupole: -6.1570 2.2004 3.9565 -8.3877 -4.1017 0.5769
hfenergy: -894.6023951 hartree
pointgroup: C01 [X(C21H34O1)]
dipole: -0.4869392 -0.5604006 -0.3184275 debye
polarizability: 242.327886|-4.6790383|253.9464596|30.6203459|-6.9190315|189.8233488 unknown
InChI: InChI=1S/C21H34O/c1-2-3-4-5-6-7-8-9-10-11-12-13-14-16-20-17-15-18-21(22)19-20/h7-8,15,17-19,22H,2-6,9-14,16H2,1H3
charge 0 multiplicity 1
56 atoms
O  3.130386 2.628882 -0.163188
C  -0.496345 -2.902907 0.498643
C  -1.843741 -2.253317 0.111249
C  0.706767 -2.26908 -0.236395
C  -3.0392 -2.780746 0.934618
C  2.034402 -3.02267 -0.002655
C  -4.413821 -2.248372 0.439295
C  3.263947 -2.376832 -0.7107
C  -3.996134 2.324511 -1.467153
C  -2.483679 2.091472 -1.231844
C  -4.932022 1.59037 -0.463493
C  -1.961145 2.633826 0.118139
C  -4.538519 -0.739864 0.519743
C  3.736695 -1.08366 -0.059386
C  -4.805105 0.082172 -0.529164
C  -0.423739 2.543417 0.259661
C  3.206667 0.171723 -0.452036
C  4.707269 -1.117604 0.975637
C  0.091755 3.073706 1.615314
C  3.634071 1.360163 0.186414
C  5.134882 0.07674 1.600378
C  4.603348 1.324526 1.2136
H  -0.342258 -2.816636 1.594567
H  -0.536747 -3.990065 0.275288
H  -2.036973 -2.431903 -0.96781
H  -1.775209 -1.152809 0.231617
H  0.812851 -1.214936 0.089836
H  0.49452 -2.242322 -1.326725
H  -3.052632 -3.889579 0.897101
H  -2.900213 -2.505505 2.000807
H  1.923925 -4.063012 -0.371806
H  2.237742 -3.092729 1.085031
H  -4.579443 -2.577051 -0.606219
H  -5.211573 -2.718493 1.05236
H  3.00352 -2.19799 -1.773034
H  4.096126 -3.106692 -0.704293
H  -4.256969 1.997152 -2.494878
H  -4.208859 3.412548 -1.420744
H  -2.265005 1.005756 -1.296678
H  -1.918843 2.577364 -2.054954
H  -5.977536 1.881295 -0.700075
H  -4.737288 1.939461 0.568667
H  -2.272901 3.693222 0.235711
H  -2.427637 2.075863 0.954996
H  -4.392225 -0.296265 1.519216
H  -4.943558 -0.366949 -1.527424
H  0.041951 3.122783 -0.567673
H  -0.107674 1.486372 0.128017
H  2.467486 0.219261 -1.263899
H  5.132262 -2.080081 1.284002
H  -0.200307 4.131109 1.759847
H  1.192655 3.013294 1.67966
H  -0.335575 2.490603 2.452764
H  5.890256 0.038285 2.393326
H  4.920405 2.260316 1.683003
H  2.388891 2.548076 -0.813878
