program: Gaussian 09
title: 000242466
version: EM64L-G09RevD.01
frameworkgroup: C1[X(C20H25N)]
method: RPBEPBE
basis: SDD
operation: Freq
keyword: #pfreq=noraman
keyword: PBEPBE/SDD
title: #p freq=noraman PBEPBE/SDD
converged: YES YES NO NO
title: Mulliken charges:
elementType: N C C C C C C C C C C C C C C C C C C C C H H H H H H H H H H H H H H H H H H H H H H H H H
charge: -0.088152 0.110999 -0.503828 -0.523412 -0.116194 -0.027959 0.429258 0.449281 -0.732474 -0.763803 -0.660279 -0.363943 -0.396438 -0.422650 -0.422445 -0.258275 -0.248630 -0.248993 -0.260800 -0.245918 -0.247559 0.200294 0.210539 0.233789 0.194003 0.199638 0.209841 0.218574 0.217033 0.248526 0.225436 0.211055 0.225867 0.192698 0.217509 0.239114 0.236167 0.231244 0.247913 0.241619 0.222217 0.222524 0.221302 0.222780 0.226346 0.226186
chargesum: 0.00000
title: Mulliken charges with hydrogens summed into heavy atoms:
elementType: N C C C C C C C C C C C C C C C C C C C C
charge: -0.088152 0.110999 -0.092995 -0.095620 0.083444 0.181882 0.429258 0.449281 -0.048340 -0.101446 -0.010958 -0.127776 -0.165194 -0.174737 -0.180826 -0.036059 -0.026106 -0.027691 -0.038020 -0.019572 -0.021372
polarizability: 2.28134107e+02 9.64718639e+00 2.13745425e+02 6.93366455e+00 1.10069924e+01 1.94773040e+02
1716.lowfreq: -14.5069 -6.8180 -3.9642 -0.0009 -0.0008 0.0005 33.4664 52.4960 60.3304
frequency: 33.0267 52.4256 60.3262 67.6837 77.7306 103.0074 131.8239 163.0669 202.3796 203.3530 217.0549 229.3305 245.9298 254.3804 263.6399 292.6715 309.9875 325.7543 364.1221 379.5054 395.8820 402.7432 406.3231 457.1126 464.2303 501.4171 516.8005 537.3179 583.2131 592.2386 616.9028 619.0151 660.7616 686.4614 703.8337 706.7333 713.9017 758.9950 777.0427 831.5605 848.9855 851.2884 857.7070 869.8862 890.1741 905.8284 925.3436 931.4055 950.2955 972.7869 975.4007 986.3308 990.3561 990.6954 992.3758 994.3478 1013.6187 1027.6789 1030.5372 1059.4123 1071.1668 1083.3370 1088.1481 1090.0071 1103.0072 1106.2325 1125.8063 1164.4660 1172.0448 1172.6131 1177.7167 1185.5356 1188.8569 1197.5050 1201.4299 1202.5277 1269.1196 1295.4961 1301.5310 1309.6260 1320.5676 1325.7218 1337.3711 1344.8449 1354.1469 1361.3891 1374.3112 1376.0478 1379.0548 1381.8214 1431.2179 1431.9249 1434.7485 1451.3990 1460.4743 1462.4130 1469.2067 1471.1998 1475.0578 1482.0930 1484.7762 1487.9261 1496.6806 1587.2685 1588.8812 1607.5978 1611.4320 2852.0318 2869.5755 2952.4988 2978.7714 2984.7091 2989.9966 2994.6439 3022.4079 3044.7538 3049.6678 3069.2965 3073.5750 3077.3334 3085.6556 3099.4864 3117.2588 3117.9500 3123.2853 3125.0567 3137.6413 3138.8086 3148.1975 3153.9576 3162.0378 3165.5139
redmass: 3.7549 3.6039 4.5398 3.5131 3.4194 3.0389 3.4240 1.3599 2.4215 1.3525 2.1046 2.2352 2.9216 2.1429 2.6226 3.7020 3.2057 2.7583 1.7558 2.3689 2.5897 2.7834 2.8195 3.4610 3.3210 2.7038 2.3817 3.0630 3.2100 4.0491 6.3934 6.2692 3.8921 3.2643 1.7150 1.6387 3.5697 1.9126 2.1491 2.3837 1.2943 1.3150 2.4325 1.7951 2.1556 1.5252 1.5533 1.7723 1.7053 1.4462 1.3917 2.0181 3.4233 2.7045 1.5803 1.7151 1.8728 2.4270 2.2638 1.7237 1.9567 2.0153 1.9529 2.1084 1.9205 1.5816 1.7391 2.6640 1.0817 1.0591 2.4444 2.9774 2.2028 1.2672 1.2621 1.7311 1.6674 1.3005 1.7347 1.4320 1.3541 1.3769 1.2451 1.3898 1.4508 1.3643 4.5624 2.1296 2.1630 1.2204 1.4515 1.5828 2.2647 1.1073 1.0721 1.0522 1.0754 1.0730 1.0735 2.0042 2.0693 1.0524 1.0516 5.9018 5.8962 6.0121 5.9925 1.0788 1.0570 1.0826 1.0365 1.0383 1.0587 1.0600 1.0736 1.1015 1.1014 1.0991 1.0993 1.0996 1.0987 1.0981 1.0845 1.0844 1.0870 1.0875 1.0926 1.0933 1.0942 1.0953 1.1009 1.0983
irintensity: 0.0258 0.0790 0.0672 0.2812 0.0174 0.3603 0.2553 0.1088 1.0741 1.3683 0.2101 1.1234 0.4944 0.4085 2.5628 0.1746 0.2019 0.5977 0.5961 1.9012 1.3518 0.2023 0.6303 0.6240 0.6498 3.4996 4.8481 12.1389 14.5322 0.9765 0.0129 0.4983 7.6131 5.3098 50.3127 60.5278 5.8413 45.5226 24.5307 2.3003 0.3674 0.1955 1.7245 2.3712 1.1703 0.6399 1.4220 5.1098 2.1154 0.3056 0.0121 1.2331 0.4983 0.1659 0.6067 0.3918 22.0087 14.3139 11.4241 2.5763 20.6925 7.4533 5.1793 1.2182 4.7209 13.6257 3.1073 14.3126 0.9112 0.3113 15.1984 10.4246 7.5667 4.1840 4.4947 3.6043 14.5395 1.4465 15.5021 6.6968 0.5484 1.7820 13.2153 3.8711 18.7622 5.3645 3.9495 12.5512 3.5746 21.2371 7.5694 1.3468 10.5801 11.4557 14.3356 7.1167 18.5458 15.0678 10.4520 24.4321 18.7061 5.5209 6.4984 2.4861 1.8359 16.0205 7.0116 57.1580 126.0780 35.4476 26.6793 31.3786 43.9967 26.2675 51.1881 10.2440 35.8382 41.1823 46.1706 27.8040 37.2753 28.6402 4.9846 5.1429 0.5223 2.5168 20.7421 33.5858 40.4341 39.1383 21.3825 15.4156
temp: 298.150 k
press: 1.00000 atm
elementType: 7 6 6 6 6 6 6 6 6 6 6 6 6 6 6 6 6 6 6 6 6 1 1 1 1 1 1 1 1 1 1 1 1 1 1 1 1 1 1 1 1 1 1 1 1 1
symmnumber: 1
zpe: 1040775.0 jmol-1
zpe.correction: 0.396410 hartree
zpe.thermalcorrener: 0.415855 hartree
zpe.thermalcorrenthalpy: 0.416799 hartree
zpe.thermalcorrgfe: 0.349345 hartree
zpe.sumelectzpe: -830.309664 hartree
zpe.sumelectthermal: -830.290219 hartree
zpe.sumelectthermalent: -830.289275 hartree
zpe.sumelectthermalfe: -830.356729 hartree
dipole: 0.5572 0.5108 -0.0426
dipole: 0.7570
quadrupole: -122.7892 -127.0620 -118.5576
quadrupole: 1.1246 1.7127 2.6591
quadrupole: 0.0137 -4.2590 4.2453 1.1246 1.7127 2.6591
hfenergy: -830.7060742 hartree
pointgroup: C01 [X(C20H25N1)]
dipole: 0.2378601 0.1778214 -0.0226785 debye
polarizability: 230.1055589|8.2844187|212.293432|7.3990481|9.8775471|194.253581 unknown
InChI: InChI=1S/C20H25N/c1-16-14-20(15-17(2)21(16)3,18-10-6-4-7-11-18)19-12-8-5-9-13-19/h4-13,16-17H,14-15H2,1-3H3
charge 0 multiplicity 1
46 atoms
N  2.65088 -1.653296 -0.30776
C  -0.074261 -0.373142 -0.106031
C  0.574069 -0.887829 -1.428824
C  0.629923 -1.160859 1.044282
C  2.122498 -0.864642 -1.464348
C  2.180625 -1.150294 1.014447
C  -1.594367 -0.712704 -0.050348
C  0.033638 1.171086 0.031531
C  2.743359 0.553148 -1.634966
C  2.701253 -2.031845 2.169913
C  4.106866 -1.886008 -0.396631
C  -2.34052 -0.330599 1.098431
C  -0.47963 1.993248 -1.008088
C  -2.282245 -1.389917 -1.088911
C  0.553747 1.816247 1.182127
C  -3.713458 -0.627956 1.214976
C  -0.451219 3.399736 -0.916696
C  -3.662131 -1.685532 -0.97953
C  0.583203 3.227191 1.282167
C  -4.384732 -1.311707 0.173533
C  0.086664 4.028391 0.2314
H  0.186614 -0.333714 -2.304238
H  0.282977 -1.948487 -1.549491
H  0.310592 -2.217743 0.961482
H  0.28354 -0.803652 2.032237
H  2.407018 -1.443341 -2.368927
H  2.548278 -0.107724 1.192651
H  3.831931 0.479733 -1.813276
H  2.293605 1.060456 -2.508332
H  2.578622 1.200447 -0.758559
H  3.793818 -1.950608 2.304029
H  2.226818 -1.723016 3.119563
H  2.447279 -3.091958 1.98407
H  4.732549 -0.995164 -0.141205
H  4.356215 -2.187543 -1.430602
H  4.406377 -2.711763 0.270483
H  -1.844369 0.225476 1.902731
H  -0.925577 1.526784 -1.894387
H  -1.753899 -1.693762 -1.99736
H  0.944417 1.22487 2.016086
H  -4.262231 -0.320735 2.112755
H  -0.855868 4.006303 -1.735187
H  -4.169378 -2.208741 -1.798648
H  0.994236 3.697334 2.183229
H  -5.452628 -1.542168 0.258855
H  0.109601 5.121299 0.306967
