program: Gaussian 09
title: 000242464
version: EM64L-G09RevD.01
frameworkgroup: C1[X(C13H29NO)]
method: RPBEPBE
basis: SDD
operation: Freq
keyword: #p
keyword: freq=noraman
keyword: PBEPBE/SDD
title: #p freq=noraman PBEPBE/SDD
converged: YES YES NO NO
title: Mulliken charges:
elementType: O N C C C C C C C C C C C C C H H H H H H H H H H H H H H H H H H H H H H H H H H H H H
charge: -0.452283 -0.103975 -0.370579 -0.357523 -0.359113 -0.378241 -0.358736 -0.357437 -0.360258 -0.339869 -0.340820 -0.366863 -0.341997 -0.695316 -0.694944 0.182286 0.200167 0.178026 0.199484 0.177558 0.199462 0.192086 0.214391 0.208556 0.184976 0.183826 0.209096 0.183697 0.184449 0.191231 0.190440 0.191800 0.189883 0.216629 0.213831 0.187072 0.186974 0.209096 0.214352 0.212683 0.208865 0.214364 0.212588 0.340087
chargesum: 0.00000
title: Mulliken charges with hydrogens summed into heavy atoms:
elementType: O N C C C C C C C C C C C C C
charge: -0.112196 -0.103975 0.011875 0.019988 0.017906 0.028236 0.034796 0.035484 0.007888 0.041802 0.040863 0.063596 0.032049 -0.059185 -0.059126
polarizability: 1.76769526e+02 -7.49658038e-01 1.61324144e+02 -1.28090370e+00 1.10816687e+00 1.29236936e+02
1716.lowfreq: -4.9414 -3.5655 -0.0007 -0.0006 0.0000 10.3577 24.9363 32.4089 40.3837
frequency: 24.7396 32.2254 40.2340 48.2371 51.7162 67.1015 75.3884 87.0483 104.1221 117.8847 120.8207 132.1471 154.4634 173.4835 207.4544 218.9715 233.3180 240.7989 272.2361 272.9274 290.3033 313.6900 366.5186 408.2987 446.1209 459.2351 507.0497 524.7868 730.9588 733.2658 739.7382 775.9625 790.8373 793.6983 826.9444 846.5613 897.6055 898.7489 925.3397 927.1512 954.5703 963.0706 989.6809 1009.1832 1022.6287 1043.2860 1056.9089 1068.7671 1073.0796 1076.8011 1086.3520 1090.0213 1107.8690 1112.1060 1141.8181 1154.7045 1189.8066 1197.7243 1206.4118 1227.4941 1233.9665 1243.8889 1254.9886 1267.6643 1270.2966 1279.1664 1282.4113 1283.6991 1287.6930 1289.4082 1297.4843 1301.1064 1316.4010 1343.4517 1344.2811 1356.4253 1367.5448 1369.2395 1378.9537 1389.0251 1389.9587 1415.0989 1463.1982 1464.2406 1465.5890 1468.6999 1470.5343 1471.5632 1473.4896 1476.9133 1477.8395 1479.1824 1480.9003 1482.7743 1488.2157 1490.1012 1491.2072 2834.7880 2837.0812 2852.4577 2925.0101 2951.0156 2961.3690 2961.7967 2971.9792 2972.1360 2972.3942 2975.8170 2977.1670 2977.6436 2992.1899 2994.3996 3003.1647 3003.6782 3013.1629 3016.4454 3018.4722 3043.0594 3045.7447 3046.2783 3060.2007 3069.1017 3069.5974 3070.8663 3071.3213 3564.9680
redmass: 4.2819 3.8180 3.3062 1.6956 1.5639 2.6048 1.9185 3.2255 2.4701 2.4577 1.8659 2.4512 2.6506 2.4765 3.1971 2.0020 1.4403 1.1427 1.6672 1.4200 2.6362 2.8789 3.3961 3.1262 3.1967 3.0103 3.0181 3.2033 1.0765 1.0752 1.0770 1.1269 1.2069 1.1812 3.3414 1.3056 1.7230 1.7415 1.2715 1.2221 1.2826 7.3051 3.0119 3.0214 3.1105 3.1362 3.1793 2.3641 2.2984 2.2527 2.2452 2.2205 2.1270 2.2792 1.6794 1.3812 2.0246 1.5821 1.3986 1.3971 1.4448 1.3220 1.3405 1.2980 1.3041 1.0652 1.0737 1.0925 1.1706 1.1429 1.2259 1.2490 1.3532 1.5108 1.5222 1.5583 1.4005 1.3943 1.4333 1.2176 1.2349 1.4378 1.0728 1.0716 1.0749 1.0725 1.0698 1.0759 1.0882 1.0424 1.0428 1.0739 1.0663 1.0837 1.0870 1.0890 1.0957 1.0713 1.0711 1.0706 1.0545 1.0588 1.0586 1.0586 1.0372 1.0375 1.1064 1.0601 1.0622 1.0605 1.0645 1.0924 1.0969 1.0973 1.0875 1.0878 1.0890 1.1027 1.1020 1.1013 1.1043 1.1004 1.1005 1.0995 1.0997 1.0664
irintensity: 0.1228 0.2199 0.0349 4.8074 3.6978 0.3046 0.0459 0.4830 0.3782 0.7496 2.8485 1.9474 0.5976 1.1050 1.0854 1.8639 1.4241 0.0140 65.4116 90.0651 0.5941 5.2313 1.0141 2.0703 11.6857 6.5550 1.9878 12.2774 8.3633 8.8092 8.7899 0.2703 0.1600 0.0479 14.5303 2.7047 15.8024 5.5631 6.0632 1.8605 4.3373 45.8174 36.0522 0.9448 13.4709 19.3716 5.8673 9.0465 4.8436 1.2615 34.1782 28.3115 1.1062 0.7324 5.4843 3.3206 11.2791 8.4952 20.2991 7.0372 4.2799 10.9941 15.5732 1.4338 2.7524 1.6733 0.2404 1.0535 2.9986 3.3308 22.0243 11.0356 2.1969 0.7803 0.8399 0.4097 12.6968 11.0131 3.4967 7.0800 9.6390 5.0489 0.6654 0.6477 0.1975 0.4943 0.8455 0.2917 0.4679 12.5464 12.2538 3.6489 5.2351 5.4924 16.2772 14.2992 9.4128 42.2643 42.8859 209.7846 60.2596 39.7221 25.1768 28.7486 41.6266 21.2177 53.7505 49.8992 15.0769 57.7813 34.9192 20.8773 11.6405 7.9251 7.3101 14.8353 10.8169 29.7861 36.1844 58.8119 123.4133 80.8250 103.4269 48.4054 67.4273 2.0950
temp: 298.150 k
press: 1.00000 atm
elementType: 8 7 6 6 6 6 6 6 6 6 6 6 6 6 6 1 1 1 1 1 1 1 1 1 1 1 1 1 1 1 1 1 1 1 1 1 1 1 1 1 1 1 1 1
symmnumber: 1
zpe: 1052775.5 jmol-1
zpe.correction: 0.400981 hartree
zpe.thermalcorrener: 0.421661 hartree
zpe.thermalcorrenthalpy: 0.422605 hartree
zpe.thermalcorrgfe: 0.348609 hartree
zpe.sumelectzpe: -641.441235 hartree
zpe.sumelectthermal: -641.420555 hartree
zpe.sumelectthermalent: -641.419611 hartree
zpe.sumelectthermalfe: -641.493607 hartree
dipole: -0.1347 0.9799 2.2361
dipole: 2.4451
quadrupole: -89.6298 -97.1200 -100.5220
quadrupole: -6.4615 -8.8917 -0.9934
quadrupole: 6.1275 -1.3627 -4.7647 -6.4615 -8.8917 -0.9934
hfenergy: -641.8422164 hartree
pointgroup: C01 [X(C13H29N1O1)]
dipole: -0.0473231 -0.3924111 -0.8770111 debye
polarizability: 176.743615|0.9944229|161.3648651|1.2451986|0.9028027|129.2221259 unknown
InChI: InChI=1S/C13H29NO/c1-3-5-10-14(11-6-4-2)12-8-7-9-13-15/h15H,3-13H2,1-2H3
charge 0 multiplicity 1
44 atoms
O  -6.472804 0.236345 0.801978
N  0.944375 0.007449 -0.35522
C  -0.385473 -0.432075 -0.852567
C  1.274815 1.402909 -0.746963
C  2.032338 -0.957567 -0.662961
C  -1.549999 0.078356 0.0229
C  2.215374 2.10893 0.252932
C  2.03414 -2.182245 0.276369
C  -2.934115 -0.355379 -0.510558
C  2.579497 3.546074 -0.18496
C  3.152097 -3.195561 -0.061681
C  -4.094367 0.135573 0.384463
C  -5.46743 -0.296007 -0.136182
C  3.511432 4.258353 0.819184
C  3.141957 -4.426656 0.870129
H  -0.551503 -0.116701 -1.915387
H  -0.408207 -1.538339 -0.850915
H  1.724486 1.444989 -1.773389
H  0.330518 1.977776 -0.799185
H  1.986258 -1.305727 -1.728028
H  2.999382 -0.431659 -0.550801
H  -1.514631 1.184459 0.089683
H  -1.401793 -0.30069 1.052505
H  1.722756 2.12569 1.244558
H  3.147083 1.520464 0.377311
H  1.053214 -2.697379 0.228341
H  2.146466 -1.822882 1.317765
H  -2.96651 -1.463184 -0.586726
H  -3.069844 0.032397 -1.542581
H  1.649555 4.138426 -0.309715
H  3.064108 3.515704 -1.182706
H  4.137811 -2.690449 0.002893
H  3.041925 -3.527495 -1.114843
H  -3.969211 -0.253569 1.413384
H  -4.076266 1.240545 0.45527
H  -5.523739 -1.406051 -0.186735
H  -5.630998 0.108363 -1.159786
H  4.463383 3.70654 0.936175
H  3.754361 5.285499 0.489887
H  3.039517 4.325282 1.817507
H  2.180517 -4.969414 0.797302
H  3.950967 -5.135756 0.614991
H  3.276034 -4.124685 1.925869
H  -7.377771 -0.033154 0.503491
