program: Gaussian 09
title: 000242463
version: EM64L-G09RevD.01
frameworkgroup: C1[X(C13H24O2)]
method: RPBEPBE
basis: SDD
operation: Freq
keyword: #pfreq=noraman
keyword: PBEPBE/SDD
title: #p freq=noraman PBEPBE/SDD
converged: YES YES NO NO
title: Mulliken charges:
elementType: O O C C C C C C C C C C C C C H H H H H H H H H H H H H H H H H H H H H H H H
charge: -0.269265 -0.247177 0.021797 -0.543982 -0.180982 -0.493389 -0.464203 -0.480743 -0.374462 0.187527 -0.350800 -0.358101 -0.696410 -0.260827 -0.665918 0.214005 0.243955 0.220505 0.262896 0.220184 0.214483 0.215883 0.246267 0.200072 0.202131 0.186883 0.203000 0.188963 0.186596 0.194321 0.195462 0.210420 0.215221 0.209539 0.221556 0.233205 0.215412 0.249938 0.226039
chargesum: 0.00000
title: Mulliken charges with hydrogens summed into heavy atoms:
elementType: O O C C C C C C C C C C C C C
charge: -0.269265 -0.247177 0.235801 -0.079522 0.081914 -0.058721 -0.002054 -0.078540 0.015421 0.187527 0.024759 0.031682 -0.061230 0.193934 0.025471
polarizability: 1.85284998e+02 6.21154743e+00 1.35325104e+02 1.70180078e+00 2.47984914e+00 1.20394401e+02
1716.lowfreq: -20.5073 -6.1052 -0.0008 -0.0006 0.0003 8.8280 12.7802 16.8578 27.3037
frequency: -12.5930 16.6452 27.0574 43.4619 57.3770 72.2902 81.7168 97.2488 121.0439 130.7743 167.9602 193.6821 222.8598 229.4807 245.8888 260.9762 314.6592 330.3186 352.3489 428.8858 437.8205 463.0962 542.4604 609.2411 684.6444 701.9900 721.8054 747.5484 776.9527 798.1001 815.5108 825.1528 848.7209 862.4911 893.1138 928.9637 952.7432 959.1435 969.7235 991.4443 1010.4838 1019.5852 1039.6783 1049.3991 1061.1621 1071.4378 1093.3885 1094.9115 1108.9323 1123.5185 1132.2850 1156.1012 1175.8818 1188.6381 1209.5156 1231.0158 1242.8763 1250.1438 1262.1905 1273.1984 1278.3255 1279.2036 1285.7782 1291.7157 1296.8586 1304.1870 1319.3175 1339.6937 1342.2426 1350.4709 1354.3828 1362.1171 1386.6309 1390.2940 1456.0875 1458.1322 1461.9262 1463.1294 1465.8444 1467.6151 1470.4973 1476.6627 1478.7692 1484.6754 1485.3635 1486.9541 1633.5955 2945.7000 2949.4382 2951.1060 2958.1238 2967.0435 2971.4252 2986.0794 2986.5989 2991.0602 2992.0993 2997.3955 3013.9864 3016.5195 3027.1473 3033.7079 3036.2670 3049.4318 3066.3618 3068.1040 3070.4133 3082.4033 3086.9304 3091.3181 3117.2017
redmass: 1.7212 4.6871 2.9971 2.4484 2.9112 2.6217 3.4096 3.0061 1.8895 2.5030 2.6708 1.6627 2.4280 1.1418 2.6877 2.4119 4.3215 3.4347 2.7446 2.0198 3.2847 2.9124 2.7011 3.5855 3.9012 6.3138 1.0784 1.1612 1.4774 1.6615 1.6677 1.3831 2.8028 2.4689 1.8375 1.3324 2.7947 2.2633 1.4901 1.4280 3.2593 2.7813 3.3204 1.6480 2.9186 2.3684 2.0616 2.2174 2.7093 2.0842 2.8600 1.6779 1.5528 1.7077 1.4600 1.2893 1.2576 1.2638 1.2877 1.2422 1.1671 1.1826 1.0746 1.1600 1.1839 1.2872 1.3851 1.4327 1.4438 1.5731 1.6606 1.5090 1.2171 1.2343 1.0961 1.0756 1.0718 1.0432 1.0861 1.0782 1.0774 1.0427 1.0765 1.0675 1.0758 1.0878 8.7593 1.0743 1.0645 1.0610 1.0606 1.0589 1.0364 1.0803 1.0768 1.0607 1.0361 1.1003 1.0617 1.1031 1.0594 1.0883 1.1027 1.1011 1.1026 1.1007 1.0993 1.1036 1.0976 1.1033 1.1057
irintensity: 0.0282 1.4594 0.1432 0.1334 0.8860 0.0091 0.3705 0.5629 0.0759 0.3208 0.5565 3.5519 1.4246 0.0463 0.8762 0.5467 10.6745 10.5394 0.9893 0.7539 3.9977 0.2554 0.5427 0.6564 6.7825 4.4032 10.4013 0.4734 10.1580 4.8416 2.1404 4.4104 11.5614 0.1625 6.8181 0.9413 7.5041 4.3961 2.7477 0.9740 9.1705 54.2475 1.0563 17.7747 2.4204 0.3229 22.3209 63.7844 244.1368 2.9237 23.2967 14.6130 7.4740 8.5752 14.0773 4.7905 10.8767 12.5301 8.0469 1.2332 3.6164 21.3864 1.6441 0.3692 2.4838 5.4976 0.6190 38.8499 5.4479 0.2563 0.7960 28.3320 11.5501 22.7078 13.4172 0.7323 0.7827 14.4568 8.0491 2.8824 0.6697 12.2961 4.6907 14.6952 1.9292 24.3817 133.0221 7.3401 5.2503 1.4275 29.6705 114.3332 37.1438 12.3443 14.5701 43.1112 19.7307 4.7325 40.1956 2.3947 30.4134 4.2250 108.0144 19.7875 23.0180 91.1561 53.7932 57.8872 37.4325 1.5483 35.1640
temp: 298.150 k
press: 1.00000 atm
elementType: 8 8 6 6 6 6 6 6 6 6 6 6 6 6 6 1 1 1 1 1 1 1 1 1 1 1 1 1 1 1 1 1 1 1 1 1 1 1 1
symmnumber: 1
zpe: 909437.1 jmol-1
zpe.correction: 0.346386 hartree
zpe.thermalcorrener: 0.363639 hartree
zpe.thermalcorrenthalpy: 0.364583 hartree
zpe.thermalcorrgfe: 0.298374 hartree
zpe.sumelectzpe: -659.016557 hartree
zpe.sumelectthermal: -658.999304 hartree
zpe.sumelectthermalent: -658.998360 hartree
zpe.sumelectthermalfe: -659.064570 hartree
dipole: -0.0037 -0.2503 -1.5629
dipole: 1.5828
quadrupole: -87.1671 -90.1817 -98.4600
quadrupole: 4.7165 3.7748 -1.0724
quadrupole: 4.7692 1.7546 -6.5237 4.7165 3.7748 -1.0724
hfenergy: -659.3629432 hartree
pointgroup: C01 [X(C13H24O2)]
dipole: 0.0300375 -0.2160027 -0.5832873 debye
polarizability: 184.2806448|9.2466071|136.6103686|2.5864666|-0.2300615|120.1134895 unknown
InChI: InChI=1S/C13H24O2/c1-3-5-6-7-11-8-9-12(10-11)13(14)15-4-2/h11-12H,3-10H2,1-2H3
charge 0 multiplicity 1
39 atoms
O  -3.339399 -1.45884 -0.617895
O  -2.977517 -0.268205 1.357564
C  0.742107 0.932362 -0.670982
C  -0.157806 -0.184123 -0.082202
C  -1.572577 0.177786 -0.62454
C  -0.132133 2.212885 -0.509871
C  -1.622346 1.738766 -0.520898
C  2.137568 1.05174 -0.022206
C  3.047757 -0.179549 -0.238145
C  -2.679131 -0.498932 0.16091
C  4.461999 0.00069 0.357887
C  5.378622 -1.224908 0.139837
C  6.789175 -1.03802 0.739561
C  -4.45189 -2.206825 0.047013
C  -5.771321 -1.440928 -0.085653
H  0.875206 0.726729 -1.755475
H  0.153776 -1.202493 -0.373427
H  -0.159671 -0.123288 1.024563
H  -1.64769 -0.143002 -1.678387
H  0.104794 2.699005 0.456098
H  0.078096 2.951692 -1.304006
H  -2.195902 2.17005 -1.360189
H  -2.131116 2.027464 0.415629
H  2.012749 1.232535 1.0667
H  2.648314 1.949639 -0.429232
H  3.133546 -0.38514 -1.326283
H  2.57572 -1.076586 0.212213
H  4.378751 0.206073 1.44584
H  4.937985 0.897836 -0.091087
H  5.461632 -1.427794 -0.947675
H  4.900754 -2.120731 0.586736
H  6.735706 -0.867146 1.831437
H  7.424749 -1.9261 0.567025
H  7.298239 -0.164995 0.288978
H  -4.47538 -3.169289 -0.489085
H  -4.185432 -2.364349 1.107017
H  -6.597762 -2.041973 0.337395
H  -5.724175 -0.485809 0.463856
H  -6.001797 -1.233831 -1.145026
