program: Gaussian 09
title: 000242461
version: EM64L-G09RevD.01
frameworkgroup: C1[X(C12H17N)]
method: RPBEPBE
basis: SDD
operation: Freq
keyword: #pfreq=noraman
keyword: PBEPBE/SDD
title: #p freq=noraman PBEPBE/SDD
converged: YES YES NO NO
title: Mulliken charges:
elementType: N C C C C C C C C C C C C H H H H H H H H H H H H H H H H H
charge: -0.101370 0.025379 -0.467332 -0.599371 -0.567009 0.277684 0.279050 -0.391457 -0.401151 -0.639561 -0.633974 -0.254886 -0.248311 0.183575 0.224156 0.209218 0.229021 0.239273 0.222565 0.218070 0.230848 0.230252 0.247014 0.187996 0.216147 0.186513 0.232540 0.215780 0.224553 0.224790
chargesum: 0.00000
title: Mulliken charges with hydrogens summed into heavy atoms:
elementType: N C C C C C C C C C C C C
charge: -0.101370 0.208954 -0.033959 -0.131077 -0.126375 0.277684 0.279050 -0.160609 -0.170900 0.011596 0.000860 -0.030333 -0.023521
polarizability: 1.74148745e+02 1.51397036e+00 1.36713563e+02 -1.46639326e+00 2.78497626e+00 8.11397360e+01
1716.lowfreq: -2.8452 -0.0006 -0.0004 -0.0004 15.6195 23.4373 40.3702 69.8381 125.3572
frequency: 39.9893 69.6849 125.3526 159.8809 185.7925 209.0797 252.7747 258.2635 306.2449 316.9581 339.7707 422.4950 432.1808 461.0772 478.7170 494.4272 516.0266 581.9319 607.0275 709.3286 733.6187 750.2720 794.0971 827.3954 867.3640 881.9830 897.8490 917.5049 953.9856 984.2237 1017.3360 1029.3509 1037.0335 1042.9572 1073.7554 1084.5212 1114.5743 1115.3488 1133.0163 1142.9029 1172.5435 1194.9375 1200.8005 1215.2411 1219.7676 1247.9618 1252.1188 1265.7150 1308.9642 1311.8984 1338.8125 1345.2380 1371.5462 1386.0399 1418.7457 1441.1718 1446.0337 1453.6014 1456.7693 1467.7830 1471.1497 1477.2408 1480.9913 1491.6525 1493.7817 1594.9708 1614.4633 2798.9837 2843.7921 2859.5370 2955.4460 2962.8593 2996.1594 3024.0311 3031.7927 3035.1997 3037.4569 3065.0912 3091.0175 3095.6180 3106.8904 3111.1461 3133.3311 3156.2096
redmass: 2.8263 3.1111 2.5884 2.4653 1.9987 1.3191 1.4579 2.1499 2.3985 3.3720 2.9325 2.5197 2.8261 2.8297 2.5911 2.4748 3.3845 3.4353 5.0811 3.0958 4.2628 1.2178 2.3366 3.4234 1.5893 2.2772 1.5048 2.4848 1.4101 1.3199 2.3642 1.6487 2.3598 2.2159 2.2019 1.3344 1.8470 2.0181 1.4053 1.2602 1.0634 1.7253 2.4850 1.5319 2.0525 1.3935 2.1269 1.5309 1.3899 1.3170 1.5550 1.5075 1.9069 3.6543 1.1395 2.3849 1.1632 1.1493 1.0918 1.0796 1.0748 1.0564 1.0969 1.2873 1.5500 6.5240 6.4522 1.0799 1.0578 1.0579 1.0655 1.0628 1.0640 1.0917 1.0921 1.0760 1.0735 1.1010 1.0985 1.0989 1.0864 1.0892 1.0925 1.1004
irintensity: 0.5821 0.4006 0.2928 0.0367 0.2140 0.7930 3.6023 4.4747 7.0275 0.0285 0.6105 0.2578 5.8265 0.9342 2.4609 1.5532 2.9538 1.6408 6.4894 0.2575 0.4639 66.1711 19.9925 1.3055 8.3318 7.7468 6.9912 0.3097 4.8803 0.0042 17.9054 15.0958 13.6029 18.2427 1.9373 2.5823 13.4519 0.5552 8.1328 3.2670 0.1068 7.8254 0.7582 1.6481 1.5325 4.8495 3.1004 2.3202 0.4319 1.0032 4.0951 5.5212 24.3318 1.7113 2.0588 5.4925 10.8789 0.6384 25.3902 8.2756 4.2920 12.5003 8.3339 9.7296 49.2452 4.6758 0.9622 65.5370 69.3523 198.3957 30.2555 19.0565 19.3602 34.9652 20.0448 30.2598 72.7923 47.9174 38.3725 35.2253 18.2262 2.2377 30.7730 37.0368
temp: 298.150 k
press: 1.00000 atm
elementType: 7 6 6 6 6 6 6 6 6 6 6 6 6 1 1 1 1 1 1 1 1 1 1 1 1 1 1 1 1 1
symmnumber: 1
zpe: 686719.9 jmol-1
zpe.correction: 0.261558 hartree
zpe.thermalcorrener: 0.273741 hartree
zpe.thermalcorrenthalpy: 0.274685 hartree
zpe.thermalcorrgfe: 0.223364 hartree
zpe.sumelectzpe: -521.228189 hartree
zpe.sumelectthermal: -521.216005 hartree
zpe.sumelectthermalent: -521.215061 hartree
zpe.sumelectthermalfe: -521.266382 hartree
dipole: 0.8486 0.2194 0.8182
dipole: 1.1990
quadrupole: -74.4036 -72.6872 -84.2074
quadrupole: -0.3715 2.1922 0.2749
quadrupole: 2.6958 4.4122 -7.1080 -0.3715 2.1922 0.2749
hfenergy: -521.4897464 hartree
pointgroup: C01 [X(C12H17N1)]
dipole: -0.3305827 -0.08514 0.325583 debye
polarizability: 174.2011848|1.0278442|136.7274666|0.2085007|-2.3334254|81.0733927 unknown
InChI: InChI=1S/C12H17N/c1-13(2)12-8-7-10-5-3-4-6-11(10)9-12/h3-6,12H,7-9H2,1-2H3
charge 0 multiplicity 1
30 atoms
N  -2.968094 0.302403 -0.197032
C  -1.590481 -0.102901 0.220802
C  -1.164608 -1.442023 -0.428741
C  -0.561089 0.983081 -0.178835
C  0.201931 -1.906134 0.116739
C  0.897808 0.546636 -0.063498
C  1.268463 -0.821203 0.047013
C  1.916106 1.534305 -0.092051
C  2.642469 -1.164889 0.114991
C  -3.357765 1.6434 0.300435
C  -4.001802 -0.692412 0.172455
C  3.28109 1.185925 -0.022774
C  3.64839 -0.17672 0.080125
H  -1.551561 -0.236864 1.33808
H  -1.118158 -1.296359 -1.525647
H  -1.907359 -2.234379 -0.230872
H  -0.698891 1.894047 0.432099
H  -0.780056 1.268537 -1.229371
H  0.541876 -2.803079 -0.43559
H  0.078552 -2.224782 1.173653
H  1.629976 2.59116 -0.172308
H  2.922915 -2.223263 0.194781
H  -2.710654 2.425142 -0.128627
H  -3.31959 1.730999 1.416912
H  -4.391889 1.858384 -0.021945
H  -4.029211 -0.913254 1.270738
H  -3.848862 -1.641258 -0.366002
H  -4.993411 -0.304949 -0.120834
H  4.050477 1.965833 -0.048596
H  4.705028 -0.462883 0.131299
