program: Gaussian 09
title: 000242462
version: EM64L-G09RevD.01
frameworkgroup: C1[X(C12H20O6)]
method: RPBEPBE
basis: SDD
operation: Freq
keyword: #pfreq=noraman
keyword: PBEPBE/SDD
title: #p freq=noraman PBEPBE/SDD
converged: YES YES NO NO
title: Mulliken charges:
elementType: O O O O O O C C C C C C C C C C C C H H H H H H H H H H H H H H H H H H H H
charge: -0.276367 -0.264621 -0.258424 -0.235308 -0.223055 -0.231370 -0.195049 -0.315565 -0.716253 0.244612 0.255110 0.221756 -0.257903 -0.261887 -0.258639 -0.662748 -0.668572 -0.664088 0.268359 0.314208 0.233261 0.252885 0.222910 0.222062 0.232690 0.235707 0.222116 0.228320 0.235895 0.249983 0.227429 0.216413 0.244926 0.249138 0.214887 0.227504 0.250393 0.219286
chargesum: 0.00000
title: Mulliken charges with hydrogens summed into heavy atoms:
elementType: O O O O O O C C C C C C C C C C C C
charge: -0.276367 -0.264621 -0.258424 -0.235308 -0.223055 -0.231370 0.073310 -0.001357 -0.007198 0.244612 0.255110 0.221756 0.196849 0.195937 0.205576 0.031077 0.040380 0.033095
polarizability: 1.71280161e+02 3.36709414e+00 1.42717177e+02 -3.48156474e+00 8.46853818e-01 1.32125009e+02
1716.lowfreq: -8.8179 -5.4618 -1.3881 -0.0009 -0.0009 -0.0008 17.4774 30.6727 36.4752
frequency: 16.9455 30.6047 36.4713 48.1347 54.1222 62.3123 70.6693 82.9978 88.3074 99.2725 119.7601 134.8634 160.6645 175.1553 197.1899 207.8552 209.8783 221.9507 263.3984 269.9280 288.0206 315.4155 325.1522 341.9960 381.9572 395.3464 441.4152 445.9453 494.7940 564.7738 615.3694 657.4481 681.5293 719.4278 749.6206 764.1447 795.4917 810.3683 813.6663 816.5139 825.3231 849.8283 874.6531 931.5724 952.3532 1006.3231 1013.8788 1021.4909 1044.1858 1066.5498 1093.3529 1095.8037 1096.8308 1114.8327 1128.4412 1140.5661 1156.4235 1157.3105 1158.9648 1172.4811 1234.3194 1261.8091 1275.4221 1277.5301 1278.7972 1319.7723 1329.7443 1353.9563 1355.3232 1359.1062 1389.8838 1392.0154 1395.7963 1399.8291 1455.4879 1458.6783 1459.0454 1462.9653 1463.3004 1463.7046 1468.9135 1478.4835 1484.9039 1485.2407 1487.5162 1637.5167 1642.7254 1644.1934 2992.4898 2993.6176 2994.3780 3007.3849 3011.2544 3028.4868 3030.7904 3033.6681 3036.7491 3087.4315 3088.2509 3089.4826 3092.7222 3096.0159 3096.4278 3101.2494 3117.4813 3118.7489 3120.6201 3122.9892
redmass: 4.4876 4.4958 3.4202 4.2813 3.0883 3.4387 4.5422 3.5449 3.4762 4.5527 3.7051 4.0513 2.9389 2.6471 1.1474 1.2854 1.3753 1.6080 2.1828 2.4979 2.5947 3.3296 3.9586 5.4920 4.6432 3.4747 3.4387 3.7409 3.9593 6.8489 4.5131 4.8231 5.3803 3.7792 3.5529 2.2973 2.1229 1.3564 1.5770 1.8266 2.7441 3.6357 3.4818 2.3475 2.6766 2.5140 2.7845 3.1798 2.0764 2.0338 2.2839 2.1549 2.1386 2.9077 2.3879 3.4185 1.6718 1.7099 1.6972 3.3594 1.4983 1.4312 1.1204 1.1167 1.1260 1.6804 1.4719 1.3146 1.2998 1.3494 1.2337 1.2335 1.2238 1.2048 1.0941 1.0932 1.0901 1.0442 1.0430 1.0473 1.0548 1.0451 1.0512 1.0518 1.0511 10.0186 9.1478 9.4374 1.0361 1.0361 1.0364 1.0368 1.0815 1.0594 1.0597 1.0606 1.0809 1.0973 1.0973 1.0984 1.1034 1.1023 1.1028 1.0996 1.1008 1.1058 1.1060 1.1065
irintensity: 0.3217 0.2286 1.5203 1.8205 0.4515 1.3948 1.4243 0.3337 2.1913 0.0248 0.5763 1.0128 1.1685 0.7982 0.3842 4.1686 4.5620 1.6175 1.9558 2.3479 9.3204 7.6408 11.6212 21.1564 5.9206 3.3581 4.1195 1.6394 6.8292 10.5495 7.6113 1.3635 5.2619 9.9259 14.0153 13.1091 1.2428 2.7741 5.0015 2.4525 5.7063 10.1520 4.1511 6.0975 22.8664 21.2743 62.5908 117.3732 64.7011 135.4104 60.4507 33.5858 28.6048 218.7859 189.2894 110.7967 9.7569 17.7852 10.3425 165.1831 54.0686 117.6067 3.1459 3.0815 11.0685 31.6671 39.5577 3.6739 1.0650 10.9792 23.9189 23.3623 15.2429 39.6856 11.8760 11.9112 14.5339 16.2023 13.6019 12.9541 3.6606 8.2907 13.1651 13.3206 22.7088 138.8973 161.1377 174.4143 21.4229 20.9905 14.6153 12.4066 10.1497 23.5613 33.9884 27.7050 3.4081 32.7225 33.2897 32.7259 0.5529 6.3367 1.5311 23.9703 7.9300 33.4315 27.5971 29.2782
temp: 298.150 k
press: 1.00000 atm
elementType: 8 8 8 8 8 8 6 6 6 6 6 6 6 6 6 6 6 6 1 1 1 1 1 1 1 1 1 1 1 1 1 1 1 1 1 1 1 1
symmnumber: 1
zpe: 812541.1 jmol-1
zpe.correction: 0.309481 hartree
zpe.thermalcorrener: 0.331258 hartree
zpe.thermalcorrenthalpy: 0.332202 hartree
zpe.thermalcorrgfe: 0.255735 hartree
zpe.sumelectzpe: -919.201617 hartree
zpe.sumelectthermal: -919.179840 hartree
zpe.sumelectthermalent: -919.178896 hartree
zpe.sumelectthermalfe: -919.255363 hartree
dipole: 0.4283 -0.8013 -3.3710
dipole: 3.4913
quadrupole: -94.9340 -101.8204 -107.9748
quadrupole: 0.8966 -1.2380 -0.7072
quadrupole: 6.6424 -0.2440 -6.3984 0.8966 -1.2380 -0.7072
hfenergy: -919.511098 hartree
pointgroup: C01 [X(C12H20O6)]
dipole: 0.0445966 0.5919282 -1.2386877 debye
polarizability: 167.3356812|-10.6437255|146.97221|1.8391469|-0.0278325|131.8144567 unknown
InChI: InChI=1S/C12H20O6/c1-5-16-10(13)8(4)9(11(14)17-6-2)12(15)18-7-3/h8-9H,5-7H2,1-4H3
charge 0 multiplicity 1
38 atoms
O  -0.788714 2.574799 -0.236065
O  -1.277858 -0.700296 -1.319278
O  2.60091 -1.021531 -0.887559
O  -2.403008 1.491187 1.05357
O  -0.11057 -2.353119 -0.151013
O  2.670173 -0.237277 1.30747
C  -0.023142 0.770189 1.155646
C  0.618402 0.025607 -0.069008
C  -0.415115 -0.158959 2.319583
C  -1.214099 1.611095 0.683023
C  -0.247814 -1.162079 -0.502355
C  2.052099 -0.417649 0.234439
C  -1.842244 3.466082 -0.812895
C  -2.330733 -1.696725 -1.704345
C  4.00068 -1.540134 -0.758561
C  -2.069979 4.68644 0.083169
C  -3.37304 -1.836943 -0.591547
C  5.01842 -0.433653 -1.047495
H  0.753665 1.478685 1.503888
H  0.66194 0.734969 -0.91565
H  -1.22637 -0.848853 2.032663
H  0.459723 -0.746356 2.64148
H  -0.775303 0.436454 3.17548
H  -1.436017 3.744074 -1.798655
H  -2.768288 2.877103 -0.934023
H  -1.834669 -2.658511 -1.92407
H  -2.757935 -1.268588 -2.624924
H  4.041258 -2.350085 -1.503599
H  4.125715 -1.950201 0.258701
H  -2.485068 4.383385 1.058876
H  -1.127096 5.235549 0.24922
H  -2.789612 5.373937 -0.399238
H  -2.938021 -2.324636 0.296781
H  -3.766415 -0.849437 -0.295903
H  -4.214568 -2.459469 -0.948339
H  4.844256 0.012887 -2.04169
H  4.964423 0.358546 -0.282405
H  6.039909 -0.857183 -1.033874
