program: Gaussian 09
title: 000242459
version: EM64L-G09RevD.01
frameworkgroup: C1[X(C10H17NO4)]
method: RPBEPBE
basis: SDD
operation: Freq
keyword: #p
keyword: freq=noraman
keyword: PBEPBE/SDD
title: #p freq=noraman PBEPBE/SDD
converged: NO YES NO NO
title: Mulliken charges:
elementType: O O O O N C C C C C C C C C C H H H H H H H H H H H H H H H H H
charge: -0.412390 -0.418478 -0.236488 -0.234680 -0.248636 -0.068629 -0.050175 -0.121228 -0.442901 -0.489258 -0.560902 -0.554089 -0.772967 0.186654 0.167851 0.201919 0.254847 0.230386 0.235956 0.190432 0.221836 0.215149 0.240494 0.241017 0.252943 0.247501 0.285023 0.246143 0.241395 0.198310 0.377230 0.375735
chargesum: 0.00000
title: Mulliken charges with hydrogens summed into heavy atoms:
elementType: O O O O N C C C C C C C C C C
charge: -0.035160 -0.042743 -0.236488 -0.234680 -0.008142 0.133290 0.204672 0.109158 -0.016513 -0.052272 -0.066942 -0.021565 -0.087120 0.186654 0.167851
polarizability: 1.43958665e+02 -1.38883133e+00 1.22060262e+02 1.19564007e+00 4.82324093e-01 1.07328172e+02
1716.lowfreq: -0.0010 -0.0010 -0.0007 5.3128 10.6863 12.3326 23.4307 36.4925 51.5809
frequency: 23.2430 36.4590 51.4765 65.1744 82.9216 112.6713 134.4706 155.6224 209.2348 219.0359 266.6460 293.4170 307.7506 339.3603 382.8797 411.0874 436.5088 444.5192 471.7786 504.8821 516.5105 533.2882 565.2533 610.7784 643.3752 647.4460 651.9759 733.1787 779.6540 809.2758 843.6791 857.4510 875.2671 887.1059 921.8626 946.4158 977.0843 1004.3827 1025.7385 1044.4088 1060.0993 1068.7796 1096.2143 1108.9611 1131.3641 1138.4194 1160.7759 1179.9820 1199.1255 1217.6579 1225.3157 1252.1993 1265.5053 1271.3546 1291.4629 1309.6404 1320.5355 1328.1193 1331.8770 1345.8367 1352.1560 1355.5472 1365.3907 1385.4681 1428.3470 1445.9360 1457.0606 1459.3546 1468.5289 1473.9236 1495.1608 1653.4448 1665.2511 2932.2309 2957.4123 2967.5141 2974.9079 2978.2635 2983.5814 2988.0499 3038.1050 3046.7820 3048.8237 3053.3429 3072.2005 3099.4859 3104.6645 3406.5414 3502.8976 3508.6025
redmass: 9.6986 7.2203 6.4591 4.1440 4.2150 3.7227 4.4195 2.9676 1.7007 2.9790 2.1182 2.3797 5.1409 2.0485 2.9530 3.6265 2.7152 2.1417 2.7470 2.5011 2.3957 3.8434 2.0456 2.9287 1.3075 1.4460 1.9421 4.5968 3.0580 2.5429 2.3533 2.8064 2.4586 2.0366 1.9361 1.5795 2.3498 1.9091 2.5466 2.2236 2.0950 1.8553 2.9428 2.3295 1.8573 2.7843 2.8177 1.4623 1.3802 1.3012 1.3062 1.4179 1.4298 1.3158 1.5312 1.3370 1.4261 1.4138 1.3609 1.2744 1.4791 1.5400 1.6287 1.2287 1.0929 1.1394 1.0945 1.1102 1.0936 1.0627 1.0563 8.0300 8.1863 1.0816 1.0668 1.0700 1.0555 1.0649 1.0732 1.0653 1.0612 1.0955 1.0990 1.1014 1.0940 1.1009 1.0993 1.0740 1.0638 1.0638
irintensity: 1.2121 0.7939 0.2244 0.0375 1.7410 0.0462 1.9671 6.2197 0.4783 1.3861 0.9535 1.1784 3.0477 7.8273 2.6442 1.6494 2.3368 5.2392 18.0145 44.3869 19.3919 21.4060 55.5838 9.0568 156.1571 86.2426 141.7630 10.9073 3.1898 4.9879 2.3028 11.8516 13.6143 2.8973 16.9154 14.5355 34.3063 194.0798 79.8166 58.1384 165.7759 4.9387 68.9063 24.2032 21.1203 33.6259 21.9054 5.0330 7.5068 1.4777 22.4549 3.6430 2.4203 2.0469 29.9123 16.4637 20.9003 8.3586 4.5368 4.1918 25.8560 9.0686 36.2992 25.3277 31.0492 11.6956 9.6267 7.9903 16.5613 1.2487 14.3804 222.5137 189.5151 11.8275 21.5117 3.9737 35.5997 31.5650 39.3857 40.2946 18.0716 29.9339 12.5203 44.1934 31.1841 20.2208 11.6069 1.9429 25.4256 20.4355
temp: 298.150 k
press: 1.00000 atm
elementType: 8 8 8 8 7 6 6 6 6 6 6 6 6 6 6 1 1 1 1 1 1 1 1 1 1 1 1 1 1 1 1 1
symmnumber: 1
zpe: 698592.1 jmol-1
zpe.correction: 0.266080 hartree
zpe.thermalcorrener: 0.281788 hartree
zpe.thermalcorrenthalpy: 0.282732 hartree
zpe.thermalcorrgfe: 0.221580 hartree
zpe.sumelectzpe: -745.734161 hartree
zpe.sumelectthermal: -745.718453 hartree
zpe.sumelectthermalent: -745.717509 hartree
zpe.sumelectthermalfe: -745.778661 hartree
dipole: 0.8836 -0.1495 2.3760
dipole: 2.5393
quadrupole: -88.3509 -91.2074 -90.1307
quadrupole: 6.3822 -2.9083 -4.5196
quadrupole: 1.5454 -1.3111 -0.2343 6.3822 -2.9083 -4.5196
hfenergy: -746.0002408 hartree
pointgroup: C01 [X(C10H17N1O4)]
dipole: 0.3182954 0.1868247 -0.9283761 debye
polarizability: 143.4925011|3.4047347|122.2117664|-1.7757941|1.8760502|107.6428312 unknown
InChI: InChI=1S/C10H17NO4/c1-6-8(5-10(14)15)7(2-3-11-6)4-9(12)13/h6-8,11-12,14H,2-5H2,1H3
charge 0 multiplicity 1
32 atoms
O  2.615809 -2.197243 0.440953
O  -4.076416 -0.717311 -0.857908
O  0.367321 -2.766797 0.411263
O  -3.203194 -0.224005 1.232743
N  1.505469 2.469613 0.423805
C  0.787915 0.340609 -0.753414
C  -0.572877 0.385446 0.016011
C  1.899656 1.077887 0.080129
C  -0.950149 1.861491 0.31406
C  0.186644 2.567716 1.091335
C  1.218848 -1.097938 -1.202275
C  -1.701575 -0.34851 -0.745804
C  3.270099 1.116512 -0.622843
C  1.309874 -2.093496 -0.066814
C  -3.016039 -0.396996 0.00835
H  0.664838 0.915498 -1.699926
H  -0.443791 -0.130372 0.990304
H  2.014904 0.534966 1.042013
H  -1.883261 1.89342 0.905916
H  -1.136129 2.396826 -0.641638
H  -0.049251 3.636334 1.247657
H  0.278774 2.104955 2.094445
H  1.558363 3.07965 -0.406646
H  0.480838 -1.491955 -1.921796
H  2.191621 -1.038618 -1.714053
H  -1.884224 0.098715 -1.741216
H  -1.424061 -1.408132 -0.911567
H  3.946474 1.772828 -0.048433
H  3.730994 0.116774 -0.679357
H  3.184489 1.524494 -1.650313
H  2.622542 -2.8489 1.194884
H  -4.915305 -0.794459 -0.326271
