program: Gaussian 09
title: 000242460
version: EM64L-G09RevD.01
frameworkgroup: C1[X(C12H13N3O4S2)]
method: RPBEPBE
basis: SDD
operation: Freq
keyword: #p
keyword: freq=noraman
keyword: PBEPBE/SDD
title: #p freq=noraman PBEPBE/SDD
converged: YES YES NO NO
title: Mulliken charges:
elementType: S S O O O O N N N C C C C C C C C C C C C H H H H H H H H H H H H H
charge: 0.868693 0.934978 -0.531990 -0.542389 -0.509678 -0.557636 -0.674418 -0.703893 -0.689557 -0.089712 -0.223450 -0.265845 -0.102396 0.531940 -0.214704 -0.354330 -0.213295 -0.219072 -0.391469 -0.396061 0.511862 0.323719 0.284292 0.238793 0.273087 0.278056 0.229097 0.230032 0.314978 0.366223 0.342470 0.324145 0.313854 0.313678
chargesum: 0.00000
title: Mulliken charges with hydrogens summed into heavy atoms:
elementType: S S O O O O N N N C C C C C C C C C C C C
charge: 0.868693 0.934978 -0.531990 -0.542389 -0.509678 -0.557636 0.006783 -0.037278 -0.062025 -0.089712 -0.223450 0.057873 -0.102396 0.531940 0.069587 -0.115538 0.059792 0.058983 -0.162372 -0.166029 0.511862
polarizability: 2.86520808e+02 -1.42626970e+01 2.10583961e+02 2.85780819e+00 1.86142692e+01 1.78419815e+02
1716.lowfreq: -5.0823 -0.0018 0.0006 0.0021 4.0597 4.9524 13.4687 26.1277 37.5964
frequency: 12.8559 26.0825 37.4315 51.1491 89.4754 96.4919 106.6214 128.8897 138.7327 156.6462 186.2853 199.3807 225.1386 243.4302 245.2461 258.2790 280.4633 298.5747 316.0855 322.9000 340.3588 352.2462 400.2952 404.1281 408.1877 414.1617 422.0646 422.8566 433.2508 459.8204 472.2981 481.5905 490.2027 520.7518 573.3562 596.6170 622.6406 624.1319 661.1410 709.2902 722.2842 748.4094 776.8310 780.0488 794.4478 809.0627 818.3800 826.1781 834.3082 838.0707 911.5185 921.0119 924.9443 952.5802 963.6488 977.0563 983.0603 994.4102 1019.9431 1044.7115 1053.4155 1066.1581 1075.2959 1128.4924 1162.3425 1180.6965 1253.4834 1296.4490 1319.2176 1329.7148 1388.4637 1399.2773 1421.2753 1431.0706 1486.5816 1490.7497 1534.7020 1564.3816 1588.6635 1611.1497 1614.4596 1646.6986 1650.6954 3131.3592 3133.1610 3136.8223 3138.1456 3156.5860 3159.2664 3160.7961 3366.3367 3376.0365 3534.9776 3563.9244 3642.7952 3702.9842
redmass: 6.6700 6.1874 3.9631 6.6711 11.8241 3.1676 4.7312 4.3799 3.6593 2.7235 10.2725 8.3186 8.5070 4.7932 4.7449 4.5147 7.3553 5.0582 6.2569 5.9792 6.2332 4.8448 3.3781 1.0955 3.9516 2.7762 5.5767 1.5388 2.6763 3.5849 1.9658 4.0319 2.5730 2.7291 3.8482 7.0747 7.5179 6.9650 7.3591 1.2786 2.9943 2.6014 9.3141 4.2434 2.1782 4.9182 1.2605 4.6883 1.6745 1.9061 5.8938 5.1780 1.6906 1.3654 1.3579 1.3768 4.5900 5.0772 1.4341 1.6034 2.3814 1.6142 1.8068 1.1881 1.1403 1.1197 1.4027 1.2988 2.6591 2.2803 3.9323 5.6940 4.9842 3.7170 3.6511 3.0476 1.0882 7.2890 7.4641 3.4454 4.6419 1.2292 1.4068 1.0887 1.0886 1.0920 1.0884 1.0955 1.0965 1.0964 1.0416 1.0598 1.1002 1.0451 1.0916 1.1040
irintensity: 1.0115 0.5180 0.1418 3.4628 1.6758 8.9007 4.0824 4.7379 3.8342 17.6820 1.7939 0.9874 6.0428 0.8554 12.5870 8.8977 6.9244 20.3298 3.3242 1.0886 8.3682 6.8976 16.1872 6.7794 5.7430 0.3431 25.2884 267.2719 43.2200 175.6226 196.8117 66.9535 25.3664 45.8807 23.2728 8.9883 62.4004 6.2207 10.8432 115.9723 1.8971 23.1954 74.8428 149.8457 66.6355 26.1687 0.3777 53.9355 35.5294 62.5630 60.8048 79.5428 18.5905 1.4647 0.0547 0.3394 3.0308 11.3052 0.8451 48.6858 48.6617 1.5435 46.1673 14.6626 38.7246 41.9722 26.0070 5.8300 81.6102 8.6988 23.4778 7.1887 2.1984 1.4974 130.3168 47.6624 26.9088 11.9422 7.9921 61.7476 136.3845 312.9768 278.6518 10.9805 14.7041 8.5249 12.8686 2.2062 14.9794 8.4525 33.5766 174.7003 22.6312 109.1778 70.8647 24.6674
temp: 298.150 k
press: 1.00000 atm
elementType: 16 16 8 8 8 8 7 7 7 6 6 6 6 6 6 6 6 6 6 6 6 1 1 1 1 1 1 1 1 1 1 1 1 1
symmnumber: 1
zpe: 632627.6 jmol-1
zpe.correction: 0.240955 hartree
zpe.thermalcorrener: 0.262593 hartree
zpe.thermalcorrenthalpy: 0.263537 hartree
zpe.thermalcorrgfe: 0.189128 hartree
zpe.sumelectzpe: -1724.486923 hartree
zpe.sumelectthermal: -1724.465286 hartree
zpe.sumelectthermalent: -1724.464341 hartree
zpe.sumelectthermalfe: -1724.538750 hartree
dipole: -3.0954 5.2962 -9.2811
dipole: 11.1252
quadrupole: -116.8269 -125.8573 -145.2930
quadrupole: -26.3360 -1.5010 9.4663
quadrupole: 12.4988 3.4684 -15.9672 -26.3360 -1.5010 9.4663
hfenergy: -1724.7278784 hartree
pointgroup: C01 [X(C12H13N3O4S2)]
dipole: 1.426516 -1.8958829 -3.6781316 debye
polarizability: 287.9568516|-9.2597095|210.3076457|0.6105393|-17.9965429|177.2600866 unknown
InChI: InChI=1S/C12H13N3O4S2/c13-8-1-3-9(4-2-8)20(16,17)10-5-6-11(14)12(7-10)21(15,18)19/h1-7H,13-15H2
charge 0 multiplicity 1
34 atoms
S  1.104914 1.452342 1.189352
S  -3.590062 -1.501856 0.342106
O  0.822152 0.885202 2.700391
O  1.535135 3.000831 0.857835
O  -3.132344 -2.029311 1.808428
O  -5.162714 -1.171224 0.003995
N  -4.129116 0.697538 -1.848951
N  -3.163578 -2.726159 -0.959248
N  5.442364 -2.088433 -1.157547
C  -0.482349 1.156954 0.21163
C  -2.519539 -0.041121 -0.133354
C  -1.332311 0.115719 0.598981
C  2.418054 0.34453 0.432151
C  -2.927369 0.830778 -1.193866
C  -0.802579 2.044616 -0.835264
C  -2.011519 1.885639 -1.524616
C  3.215111 0.852897 -0.608639
C  2.617434 -0.932135 0.986848
C  4.226152 0.034816 -1.142549
C  3.629322 -1.747966 0.451119
C  4.443501 -1.280297 -0.626588
H  -1.105438 -0.52773 1.457826
H  -0.120752 2.871167 -1.063014
H  -2.284323 2.585493 -2.322314
H  3.062804 1.875841 -0.968775
H  2.0129 -1.260755 1.839116
H  4.86032 0.412508 -1.952895
H  3.803981 -2.74522 0.871347
H  -4.372146 1.341256 -2.597533
H  -4.83729 0.047835 -1.480647
H  -4.001239 -3.307702 -1.129517
H  -2.336412 -3.274717 -0.672458
H  5.618966 -3.015697 -0.781802
H  6.038369 -1.755538 -1.909949
