program: Gaussian 09
title: 000242457
version: EM64L-G09RevD.01
frameworkgroup: C1[X(C9H12O3)]
method: RPBEPBE
basis: SDD
operation: Freq
keyword: #pfreq=noraman
keyword: PBEPBE/SDD
title: #p freq=noraman PBEPBE/SDD
converged: YES YES NO NO
title: Mulliken charges:
elementType: O O O C C C C C C C C C H H H H H H H H H H H H
charge: -0.308098 -0.437061 -0.420697 0.303269 -0.440195 0.154776 0.492164 -0.412065 -0.544730 -0.388613 -0.809347 -0.210923 0.218378 0.227592 0.222153 0.253674 0.228396 0.227845 0.226629 0.230741 0.195078 0.244642 0.393187 0.353204
chargesum: 0.00000
title: Mulliken charges with hydrogens summed into heavy atoms:
elementType: O O O C C C C C C C C C
charge: -0.308098 -0.043874 -0.067492 0.303269 0.005774 0.154776 0.492164 -0.189911 -0.291056 -0.160217 -0.124132 0.228798
polarizability: 1.57628511e+02 2.37274737e+00 1.07674062e+02 1.58119094e+00 -1.01821044e+00 6.33489454e+01
1716.lowfreq: -26.0391 -11.5029 0.0004 0.0009 0.0010 3.6529 17.1528 28.8637 51.3281
frequency: -25.9058 28.4684 51.2672 106.3624 124.5398 179.4145 217.7710 267.7030 281.4226 301.8484 341.2045 383.9662 444.4491 451.1940 488.7495 551.4717 567.8988 587.8676 716.8220 727.6615 752.4073 786.9875 807.1284 857.6045 883.3675 931.9165 938.1168 942.7488 988.4136 1001.1184 1006.6835 1018.9377 1045.6821 1118.9696 1159.4752 1184.1306 1197.4179 1230.1718 1262.4066 1272.6306 1313.2405 1334.5691 1353.5493 1389.5616 1395.2119 1395.5071 1450.8327 1460.8350 1468.6155 1470.0082 1480.5092 1506.2344 1584.7971 1640.1647 2935.3153 2949.2962 2977.5336 3004.6955 3055.7892 3087.3970 3110.3151 3137.7997 3140.1917 3153.2512 3258.6619 3575.2281
redmass: 1.0369 4.6929 4.9100 4.0177 3.3809 2.9447 4.5445 3.1604 2.3462 3.5610 2.6982 1.5832 3.7122 3.1594 5.1220 6.2304 5.7349 3.6802 3.7924 4.4030 1.1106 2.5733 1.5584 4.0934 1.4389 2.5958 2.6717 2.0911 3.4149 1.9784 1.8363 1.3780 1.5518 2.0413 1.6861 1.1436 1.5613 1.2211 2.1563 1.9018 1.2548 1.7877 1.4435 3.0301 1.3180 1.1791 1.0880 1.5485 1.1353 1.0485 1.4356 2.8896 5.9002 6.1252 1.0585 1.0684 1.0373 1.1029 1.0973 1.0988 1.0876 1.0977 1.0959 1.0925 1.0660 1.0667
irintensity: 0.3011 2.4626 1.4344 13.8144 4.9802 9.8232 2.3152 1.4653 21.6001 3.4891 33.0160 135.1525 5.3112 8.8762 4.6636 1.8960 1.9540 7.0710 11.6668 2.4008 120.8522 19.3701 27.6525 20.5754 8.6437 75.1042 298.6462 112.0102 61.3776 85.6419 40.8317 5.6122 14.1881 28.8646 15.5054 2.6353 12.6760 30.3119 81.2402 14.7624 11.8388 32.2978 13.8578 11.8610 5.2005 43.7327 2.4063 9.6910 5.9955 13.5550 42.7973 26.6282 49.2056 78.5746 47.8836 94.5235 35.9264 32.7204 22.4995 20.4605 11.9259 15.4145 26.2611 4.2610 446.4884 13.7829
temp: 298.150 k
press: 1.00000 atm
elementType: 8 8 8 6 6 6 6 6 6 6 6 6 1 1 1 1 1 1 1 1 1 1 1 1
symmnumber: 1
zpe: 507429.0 jmol-1
zpe.correction: 0.193270 hartree
zpe.thermalcorrener: 0.204779 hartree
zpe.thermalcorrenthalpy: 0.205723 hartree
zpe.thermalcorrgfe: 0.154838 hartree
zpe.sumelectzpe: -574.894221 hartree
zpe.sumelectthermal: -574.882712 hartree
zpe.sumelectthermalent: -574.881768 hartree
zpe.sumelectthermalfe: -574.932653 hartree
dipole: -1.0795 4.1486 -0.3001
dipole: 4.2972
quadrupole: -60.9240 -70.8959 -72.4599
quadrupole: -9.3804 0.1556 -2.8176
quadrupole: 7.1693 -2.8027 -4.3666 -9.3804 0.1556 -2.8176
hfenergy: -575.0874909 hartree
pointgroup: C01 [X(C9H12O3)]
dipole: 0.4668222 1.4286674 0.7741391 debye
dipolederiv: -1.6001226 0.0797105 0.0057342 -0.1461081 -0.4660724 0.0068394 0.2514217 0.0263753 -0.4976919 -1.0131598 0.4915264 0.1404311 0.4830455 -0.7944187 -0.1655531 0.1398395 -0.0945975 -0.4478838 -0.9809148 -0.0065304 -0.1601744 0.1664319 -0.4493815 0.3115295 -0.4352245 0.3111661 -0.510629 -0.1773757 -0.0600378 0.0092611 0.2153723 -0.270291 -0.0716677 0.1907937 -0.0514208 -0.145204 0.7196973 -0.0097943 -0.0824478 -0.0955521 0.3796933 0.0046154 -0.3878672 -0.007333 0.442496 0.7365523 -0.531367 -0.1741421 -0.5365604 0.6376026 0.2055113 -0.2622319 0.2044326 0.1705534 0.4525053 -0.0321527 0.0309133 0.07217 0.1622924 0.0825196 0.0889008 0.0754039 0.0203252 0.2248988 0.016453 0.0376337 -0.1684682 0.0638795 0.0780972 -0.0055605 0.0897044 -0.0978645 -0.4108533 0.2580927 0.0955913 0.0512169 -0.0410669 0.072683 0.0182352 0.0647061 -0.1673847 -0.3333951 -0.1099303 -0.0515913 -0.1903937 -0.1099275 0.0224841 -0.1001644 0.028098 -0.223399 -0.1671052 -0.0191126 -0.0337838 0.0603596 0.0818171 0.0097491 -0.0298605 0.0073363 0.069474 1.604882 -0.1166755 0.1765389 -0.083811 0.6143734 -0.2181797 0.4461767 -0.2347419 0.6691328 0.012417 -0.0506281 0.0149807 -0.0759995 -0.141995 -0.0727928 0.0331897 -0.032627 0.0280265 -0.1135425 0.018672 -0.0801841 0.1020958 0.015345 0.1130862 0.0189095 0.0432085 -0.1123098 0.0422775 -0.0922048 -0.0482778 -0.0705844 -0.0576389 -0.092115 -0.0313268 -0.0928843 0.1048747 0.0579861 -0.0521081 -0.0314121 -0.060326 -0.0090886 -0.0809564 -0.023951 -0.0869831 0.1220179 -0.0253019 0.1067023 0.0281064 0.1034388 -0.0111509 -0.0615602 0.0281162 -0.059601 0.1421766 0.0569125 0.0020205 -0.0030093 -0.1080721 -0.109721 -0.0779499 -0.0347095 -0.0723549 0.0817723 -0.0401847 -0.005093 0.0645065 0.0047333 0.0945211 -0.0577467 0.13516 -0.0319969 -0.0678782 -0.0132459 0.0224365 -0.0565944 0.0582448 -0.0018322 0.117335 -0.1068722 0.0915204 -0.003628 -0.0742868 0.0116028 -0.0196416 -0.0985293 -0.2142141 0.0334461 -0.0986596 -0.0423751 0.0334195 -0.0402569 0.0241761 0.0449393 0.0372521 0.0751575 -0.0481991 0.0508949 0.0048696 -0.059889 0.6304475 -0.0135094 0.0027776 0.2036712 0.3498514 0.0228343 0.0366504 -0.0295962 0.330973 0.4511688 0.0677513 0.0898449 0.0763725 0.2022655 -0.1340097 0.0781397 -0.1103096 0.1185201 unknown
polarizability: 157.0537189|-6.0665755|100.2971071|4.1762637|16.6465556|71.3006929 unknown
InChI: InChI=1S/C9H12O3/c1-7-2-3-8(5-12-6-10)9(11)4-7/h2-4,10-11H,5-6H2,1H3
charge 0 multiplicity 1
24 atoms
O  2.333693 0.041241 -0.522464
O  0.412616 -1.798631 -0.644546
O  4.38247 -0.656035 0.610203
C  0.071613 0.450431 0.300482
C  1.541669 0.579364 0.624204
C  -0.434632 -0.752842 -0.272001
C  -2.737563 0.096038 -0.114313
C  -0.845239 1.476139 0.627749
C  -1.824893 -0.923761 -0.466444
C  -2.231376 1.307672 0.430955
C  -4.230061 -0.086686 -0.333586
C  3.778836 0.201915 -0.387309
H  1.820247 1.639111 0.794284
H  1.80016 -0.015997 1.526779
H  -0.468335 2.414759 1.054052
H  -2.171403 -1.865218 -0.905192
H  -2.923528 2.11479 0.6974
H  -4.46687 -1.106608 -0.680866
H  -4.797303 0.095586 0.598181
H  -4.612364 0.623999 -1.090879
H  3.999802 1.274259 -0.191466
H  4.185381 -0.126829 -1.352656
H  1.350243 -1.436905 -0.712046
H  4.305535 -0.260993 1.514575
