program: Gaussian 09
title: 000242456
version: EM64L-G09RevD.01
frameworkgroup: C1[X(C9H11N3)]
method: RPBEPBE
basis: SDD
operation: Freq
keyword: #pfreq=noraman
keyword: PBEPBE/SDD
title: #p freq=noraman PBEPBE/SDD
converged: NO YES NO NO
title: Mulliken charges:
elementType: N N N C C C C C C C C C H H H H H H H H H H H
charge: -0.066147 -0.004488 -0.004500 -0.381772 -0.381760 -0.536769 -0.536788 0.382909 -0.617568 0.125496 -0.246014 -0.245995 0.231427 0.204204 0.204192 0.231427 0.243451 0.249173 0.249170 0.243459 0.229629 0.197655 0.229610
chargesum: 0.00000
title: Mulliken charges with hydrogens summed into heavy atoms:
elementType: N N N C C C C C C C C C
charge: -0.066147 -0.004488 -0.004500 0.053860 0.053859 -0.044145 -0.044159 0.382909 0.039326 0.125496 -0.246014 -0.245995
polarizability: 1.57400822e+02 4.15894025e-04 1.20316345e+02 -8.24989748e+00 -2.40453140e-04 7.28209093e+01
1716.lowfreq: -17.7540 -6.2351 -0.0007 -0.0006 -0.0004 0.6262 47.6210 78.0011 114.1211
frequency: 47.6196 77.9714 114.0981 125.9577 152.9003 201.8795 214.0377 225.0419 317.1770 329.0804 350.1630 374.6063 439.5856 465.3980 479.4787 516.7974 569.0438 590.7822 639.2241 731.5538 753.0495 809.6631 904.9567 928.6816 993.8231 999.3425 1024.1881 1060.6126 1067.6211 1119.1576 1144.1617 1152.7216 1162.4042 1177.4643 1231.6195 1267.0021 1292.9859 1293.9098 1309.7538 1313.2736 1357.1004 1370.1854 1436.1552 1441.7784 1455.0932 1465.6268 1469.2377 1487.2029 1487.5613 1589.2435 2175.8578 2182.2541 2853.0267 2856.2012 2879.1321 2989.4273 2993.4691 3025.4610 3040.2607 3044.5302 3074.6409 3075.9272 3083.2629
redmass: 4.2648 4.5283 4.7615 9.5853 3.2893 1.8942 6.7751 1.3167 3.0735 2.3116 2.4152 3.7247 5.2073 2.4442 3.8807 7.2226 4.4045 11.0682 5.4305 4.2348 2.6763 1.5472 3.8822 2.2481 2.3180 1.4875 2.8784 1.8450 1.9591 1.4470 2.3040 3.6899 1.1207 2.3883 1.3102 1.6283 2.3328 1.5357 1.6495 1.3395 1.5622 1.3911 1.1636 1.0989 1.0986 1.0502 1.0726 1.0550 1.1048 7.5230 12.6312 12.6430 1.0718 1.0687 1.0570 1.0628 1.0628 1.0746 1.0882 1.0903 1.0977 1.0989 1.1010
irintensity: 2.2635 0.0081 1.6823 2.5928 11.4888 0.1148 4.8635 0.2828 7.8769 0.6018 4.8982 0.7578 0.1992 1.5158 0.4106 0.0666 2.1398 0.0477 0.0545 4.9385 9.4558 1.1424 0.5335 0.0005 8.6749 1.3958 35.7588 17.8546 11.0192 14.3304 46.4213 2.1091 4.4144 1.3051 2.7992 10.9950 0.5611 13.2423 8.1369 31.1482 0.9484 28.5684 6.6631 14.8909 15.0485 22.6394 0.3260 10.4130 13.7370 90.2775 12.3480 30.8244 46.6287 63.7364 196.7600 1.0860 12.7369 43.3240 36.4040 29.0860 15.9952 8.5902 30.0022
temp: 298.150 k
press: 1.00000 atm
elementType: 7 7 7 6 6 6 6 6 6 6 6 6 1 1 1 1 1 1 1 1 1 1 1
symmnumber: 1
zpe: 483299.8 jmol-1
zpe.correction: 0.184079 hartree
zpe.thermalcorrener: 0.195891 hartree
zpe.thermalcorrenthalpy: 0.196835 hartree
zpe.thermalcorrgfe: 0.146017 hartree
zpe.sumelectzpe: -512.865282 hartree
zpe.sumelectthermal: -512.853470 hartree
zpe.sumelectthermalent: -512.852526 hartree
zpe.sumelectthermalfe: -512.903343 hartree
dipole: -6.6333 -0.0004 0.5991
dipole: 6.6603
quadrupole: -85.5437 -80.4239 -71.0010
quadrupole: 0.0006 4.5976 -0.0027
quadrupole: -6.5542 -1.4343 7.9885 0.0006 4.5976 -0.0027
hfenergy: -513.0493609 hartree
pointgroup: C01 [X(C9H11N3)]
dipole: -2.6154751 -0.0052172 0.1598477 debye
dipolederiv: -0.8395895 0.0001447 -0.0876041 -0.0012572 -0.4980547 0.0002916 0.1090004 0.0005544 -0.5604782 -0.295768 0.0390797 -0.0000135 0.1468156 -0.2692863 -0.0121391 0.0090338 -0.0105903 -0.2329142 -0.2952815 -0.0391406 -0.0007088 -0.1470722 -0.2701548 0.0114818 0.0067175 0.0100162 -0.2325505 0.4531954 0.1132666 -0.0895473 0.2775177 0.3413169 -0.0614707 0.0995796 -0.0718086 0.4107569 0.4542045 -0.1115403 -0.0913459 -0.2784715 0.3384221 0.0602002 0.0950215 0.0710307 0.4128036 -0.3681603 0.1013967 -0.024743 0.0638127 -0.0437241 -0.0232592 -0.0747039 -0.0436716 0.0335078 -0.3675681 -0.1019314 -0.0263098 -0.063699 -0.0452507 0.0220488 -0.0753159 0.0424347 0.0345495 0.9328926 0.002388 -0.1659408 0.0046057 0.1623406 0.0009762 -0.4568554 0.0004837 -0.007583 0.5897099 -0.0001377 0.1174569 0.0000056 0.0886172 -0.0020249 0.0979411 -0.0020254 0.3906826 -0.4269807 -0.001263 0.0541909 -0.002328 0.1315849 0.0002547 0.197019 0.0004398 0.113915 0.132439 -0.178732 -0.0065082 -0.3124128 0.1161851 0.0476662 -0.0026533 0.0433332 0.0504691 0.1310707 0.178865 -0.0035647 0.3124964 0.1189921 -0.0465683 0.0023509 -0.0422428 0.049049 -0.0531956 0.1304231 0.0224345 0.0873901 -0.0849666 -0.0196489 0.0234936 -0.0272695 0.0670347 -0.0375512 -0.0750749 0.049266 -0.0690389 0.0002205 -0.0322311 0.0016531 0.120355 -0.2320015 -0.0379976 0.0741816 0.05019 0.0688785 0.0018418 0.0357556 0.0028837 -0.1170094 -0.2332944 -0.0525137 -0.1306188 0.020501 -0.0876311 -0.0862525 0.0174986 0.0222169 0.0251519 0.0676512 0.0629745 0.0261689 0.0622187 0.0575975 0.0741766 0.0192299 0.0572175 -0.0065428 -0.0683292 0.001918 -0.094265 0.0031035 -0.0551286 -0.0446412 0.0179023 0.0033729 0.0507278 0.0856241 0.0014573 0.0943208 0.0046007 0.0552021 -0.0431511 -0.0198595 0.004346 -0.0526918 0.0845482 0.0632335 -0.0271454 0.061808 -0.0585233 0.0740706 -0.0168804 0.0561986 0.0088444 -0.0685219 0.0056263 -0.0728636 0.0066374 -0.1785789 -0.0691044 0.0576334 0.0158608 0.0714922 0.0582228 -0.0591651 -0.0004291 0.0360624 0.0013279 0.0734278 0.0025424 -0.2129826 0.0022304 -0.2795151 0.0050495 0.0729068 0.0078162 0.1784918 -0.0666097 -0.0593997 0.0186043 -0.073242 0.0563737 unknown
polarizability: 157.8080768|0.0991691|120.3138121|-5.7823463|0.3540035|72.4161872 unknown
InChI: InChI=1S/C9H11N3/c1-12-4-2-8(3-5-12)9(6-10)7-11/h2-5H2,1H3
charge 0 multiplicity 1
23 atoms
N  -2.66373 -0.003976 0.047436
N  2.898365 -2.232608 -0.253703
N  2.891589 2.245172 -0.219439
C  -1.897176 1.221835 -0.246874
C  -1.894003 -1.22332 -0.264859
C  -0.599794 1.268785 0.609945
C  -0.5961 -1.279329 0.590763
C  0.195409 -0.002829 0.429248
C  -4.017663 -0.001482 -0.538881
C  1.540252 0.001687 0.095483
C  2.282794 -1.219895 -0.094491
C  2.279214 1.228233 -0.075576
H  -2.520872 2.100356 -0.001707
H  -1.620298 1.299262 -1.329534
H  -1.617269 -1.284242 -1.348614
H  -2.515214 -2.106997 -0.032259
H  -0.906181 1.346118 1.671805
H  -0.007751 2.16467 0.356553
H  -0.001535 -2.169568 0.323703
H  -0.901817 -1.373638 1.651451
H  -4.568548 -0.897776 -0.203035
H  -4.020749 0.006443 -1.656989
H  -4.570719 0.888603 -0.190329
