program: Gaussian 09
title: 000242454
version: EM64L-G09RevD.01
frameworkgroup: C1[X(C6H8N2O)]
method: RPBEPBE
basis: SDD
operation: Freq
keyword: #pfreq=noraman
keyword: PBEPBE/SDD
title: #p freq=noraman PBEPBE/SDD
converged: NO YES NO NO
title: Mulliken charges:
elementType: O N N C C C C C C H H H H H H H H
charge: -0.257703 -0.395921 -0.026136 0.275767 0.194520 0.097472 -0.408633 -0.765973 -0.737715 0.331240 0.249268 0.246548 0.213788 0.246502 0.213273 0.261981 0.261723
chargesum: 0.00000
title: Mulliken charges with hydrogens summed into heavy atoms:
elementType: O N N C C C C C C
charge: -0.257703 -0.064681 -0.026136 0.275767 0.194520 0.097472 -0.159365 -0.059136 -0.000738
polarizability: 1.11498773e+02 -4.25372916e+00 8.78080251e+01 1.11613958e-02 3.49128496e-03 4.37809901e+01
1716.lowfreq: -98.2315 -16.2581 -12.2733 -0.0009 -0.0006 0.0002 7.4029 105.6103 125.4138
frequency: -98.1948 105.5857 125.4119 174.9526 262.2963 300.7997 319.9224 405.3275 449.2771 512.4878 557.4036 627.8974 727.3524 737.1436 739.6922 784.8851 922.1529 927.4681 1002.0883 1014.1397 1042.9113 1047.8276 1108.5450 1197.4901 1256.0027 1274.8276 1357.3077 1399.0710 1401.4499 1424.3543 1447.4565 1447.8552 1462.6082 1475.9101 1548.9176 1568.3677 1641.1119 2984.2876 3001.7909 3063.5295 3096.8203 3097.6317 3105.8895 3135.6742 3495.0651
redmass: 1.0373 1.3307 1.9043 5.7917 2.7982 3.5900 3.6289 2.6845 5.0168 4.4894 7.3198 3.9481 5.8659 2.1352 4.8193 1.9389 1.3831 2.6780 2.0232 1.4264 1.5444 1.5242 6.6827 5.8938 2.0159 2.0484 1.9040 1.2796 1.2312 3.0895 1.0446 1.0447 1.0965 1.1487 5.5122 4.6075 6.5369 1.0363 1.0363 1.0968 1.1005 1.0981 1.1009 1.0928 1.0776
irintensity: 0.4506 3.5101 4.5836 5.9774 3.7904 1.8475 0.0192 14.4367 3.6320 4.3110 0.9372 1.6417 3.0947 8.3798 3.8453 82.9202 7.2000 0.8188 19.2634 9.4895 7.3681 15.3391 19.2930 12.3851 11.3263 42.5425 1.7530 8.0677 36.6825 12.3675 6.4787 22.9684 2.3855 13.0444 154.5264 60.5383 417.9382 18.0448 10.0405 13.5878 15.1834 6.3477 15.4744 26.1419 24.9258
temp: 298.150 k
press: 1.00000 atm
elementType: 8 7 7 6 6 6 6 6 6 1 1 1 1 1 1 1 1
symmnumber: 1
zpe: 351576.4 jmol-1
zpe.correction: 0.133908 hartree
zpe.thermalcorrener: 0.141895 hartree
zpe.thermalcorrenthalpy: 0.142840 hartree
zpe.thermalcorrgfe: 0.101250 hartree
zpe.sumelectzpe: -417.515017 hartree
zpe.sumelectthermal: -417.507030 hartree
zpe.sumelectthermalent: -417.506085 hartree
zpe.sumelectthermalfe: -417.547675 hartree
dipole: 2.4842 -0.5152 0.0007
dipole: 2.5371
quadrupole: -47.2756 -58.4822 -53.6718
quadrupole: 12.7345 0.0066 -0.0046
quadrupole: 5.8676 -5.3390 -0.5286 12.7345 0.0066 -0.0046
hfenergy: -417.648925 hartree
pointgroup: C01 [X(C6H8N2O1)]
dipole: -0.98808 -0.1415514 0.000669 debye
dipolederiv: -0.7513773 -0.3405955 0.0005483 -0.5058716 -0.9924144 0.0011262 0.0021964 0.0025539 -0.3772629 -0.7547693 -0.4423041 0.0015251 0.1331414 -0.458451 0.0002395 -0.0006674 0.0009286 -0.2305585 -0.9110826 0.0100268 0.0003626 0.5590223 -0.6059126 0.0007283 -0.0004369 0.0009252 -0.2489858 0.2080681 -0.0821349 -0.0001918 -0.4222764 -0.5636089 0.0013027 0.0003727 0.0009004 -0.0432993 0.7398789 0.1052497 -0.0000042 -0.4554919 0.7692526 -0.0015294 0.0031418 -0.0023325 0.1052595 0.9725579 0.5024284 -0.0013883 0.710009 1.1347635 -0.0019667 -0.0023423 -0.003069 0.1934466 0.5771649 0.1297845 -0.0006226 -0.1816145 0.4400009 -0.0007922 -0.000462 -0.0010864 -0.0830089 -0.2062062 0.0213399 0.0001725 -0.0710649 0.1066091 -0.0000227 0.00048 -0.0001683 0.0532962 -0.3424969 0.055113 -0.0000656 -0.0493062 0.078957 0.0006579 -0.0031558 0.0011475 0.0034591 0.1743739 -0.0047682 0.0000705 0.016369 0.1391786 0.0003538 -0.0000288 0.0003787 0.3176906 0.0558453 0.0763396 -0.0000459 0.0978234 -0.0794315 0.0003037 -0.0001198 0.0003325 0.1381755 0.0147603 0.0026257 0.0588227 -0.0106764 0.0764929 0.0850216 0.0969761 0.0475119 -0.0259933 0.0640493 -0.0139914 0.0000563 0.0973545 -0.1389435 0.0003187 -0.000143 0.0003971 0.1102461 0.0144044 0.0022676 -0.0589666 -0.0111339 0.0761022 -0.0853451 -0.097045 -0.0478405 -0.0253384 0.0579738 -0.028897 -0.0001821 0.0716508 -0.1383036 -0.0016086 0.0009037 -0.0014143 0.1209529 0.0438951 0.0033784 0.0493357 0.0100299 0.0770899 0.0778445 0.0905641 0.0522614 -0.0027329 0.0429604 0.0041375 -0.0494267 0.0120352 0.0786188 -0.076632 -0.090234 -0.0514263 -0.0053464 unknown
polarizability: 111.9350987|2.7506704|87.3714675|-0.0385312|-0.0977621|43.7812225 unknown
InChI: InChI=1S/C6H8N2O/c1-4-3-7-5(2)8-6(4)9/h3,8H,1-2H3
charge 0 multiplicity 1
17 atoms
O  1.561167 1.875881 -0.005382
N  -0.63059 1.047512 -0.001025
N  -1.176295 -1.262673 0.004003
C  1.192629 -0.544432 0.000775
C  -1.556861 0.015575 0.001588
C  0.792642 0.867055 -0.000766
C  0.197198 -1.514838 0.003387
C  2.667898 -0.851273 -0.00024
C  -3.025225 0.369587 0.000645
H  -0.943679 2.024737 -0.003169
H  0.465721 -2.577449 0.004985
H  3.158322 -0.405242 -0.885027
H  2.852372 -1.938923 0.00131
H  3.160068 -0.402427 0.882151
H  -3.194487 1.459685 0.007156
H  -3.515917 -0.072079 0.884442
H  -3.512462 -0.060596 -0.890832
