program: Gaussian 09
title: 000242453
version: EM64L-G09RevD.01
frameworkgroup: C1[X(C5H2Br2O2)]
method: RPBEPBE
basis: SDD
operation: Freq
keyword: #p
keyword: freq=noraman
keyword: PBEPBE/SDD
title: #p freq=noraman PBEPBE/SDD
converged: NO YES NO NO
title: Mulliken charges:
elementType: Br Br O O C C C C C H H
charge: 0.097606 0.138187 -0.118703 -0.144163 -0.677222 0.296070 0.212550 -0.254523 -0.203974 0.354402 0.299770
chargesum: 0.00000
title: Mulliken charges with hydrogens summed into heavy atoms:
elementType: Br Br O O C C C C C
charge: 0.097606 0.138187 -0.118703 -0.144163 -0.322820 0.296070 0.212550 -0.254523 0.095796
polarizability: 1.34781156e+02 -1.47062554e+01 9.18456911e+01 2.04373030e-01 -2.39083909e+00 4.78550971e+01
1716.lowfreq: -12.7718 -5.4209 -2.2907 -0.0008 -0.0007 -0.0002 30.9208 115.8414 129.4019
frequency: 30.9079 115.8407 129.4015 163.8597 180.2609 275.3884 331.8275 394.9381 498.2955 545.3658 592.9270 681.4255 721.8660 764.3730 867.9024 902.0009 920.4826 1092.4869 1136.4135 1175.9348 1182.8022 1236.8559 1543.3304 1629.8984 1666.4914 3091.3968 3207.2100
redmass: 21.6799 10.7467 12.9197 11.9222 12.3078 18.8795 6.3124 9.5943 10.6512 5.8530 5.8404 4.4003 6.8262 6.0641 3.4686 1.5512 7.1863 2.8965 1.1671 5.7099 1.5672 1.9761 8.4055 11.7362 12.8241 1.0860 1.0989
irintensity: 2.0667 5.6003 1.6536 0.0962 0.2154 0.9452 1.8030 17.1885 18.0076 11.9942 11.8732 7.5212 46.0413 1.0127 7.1348 20.3519 26.2209 30.7729 4.3561 128.8247 15.8666 40.8005 158.4520 324.6224 44.4155 3.2051 0.9679
temp: 298.150 k
press: 1.00000 atm
elementType: 35 35 8 8 6 6 6 6 6 1 1
symmnumber: 1
zpe: 150011.0 jmol-1
zpe.correction: 0.057136 hartree
zpe.thermalcorrener: 0.065757 hartree
zpe.thermalcorrenthalpy: 0.066701 hartree
zpe.thermalcorrgfe: 0.020127 hartree
zpe.sumelectzpe: -368.417217 hartree
zpe.sumelectthermal: -368.408596 hartree
zpe.sumelectthermalent: -368.407652 hartree
zpe.sumelectthermalfe: -368.454226 hartree
dipole: 2.1273 1.1789 -0.0942
dipole: 2.4339
quadrupole: -69.6348 -78.4755 -66.8473
quadrupole: 7.2891 -1.8858 2.0840
quadrupole: 2.0177 -6.8230 4.8052 7.2891 -1.8858 2.0840
hfenergy: -368.4743529 hartree
pointgroup: C01 [X(C5H2Br2O2)]
dipole: -0.6033826 0.7398015 -0.0746355 debye
dipolederiv: -0.1889837 0.1168329 -0.0669907 0.1416285 -0.1790642 0.0718348 -0.1290569 0.1163273 -0.1218851 -0.8296767 0.1347054 0.112226 0.1493649 0.02013 -0.023531 0.1695777 -0.0358543 0.0615638 -0.4475083 -0.1705677 -0.1023469 -0.2298923 -0.7078135 -0.1585243 -0.0446846 -0.1095143 -0.3013809 -0.9631279 -0.3084174 0.1248187 -0.2083513 -0.5575649 0.0633857 0.1002276 0.0090423 -0.2980502 -0.0751334 -0.1639332 0.1024074 -0.101414 -0.1528077 -0.1634214 0.2460828 -0.2576991 0.2943912 0.5195458 -0.0092238 0.1658268 0.2153453 1.0725092 0.3056077 -0.0155308 0.2726751 0.2035024 1.4016618 0.3898276 -0.2452195 -0.2746707 0.7970876 -0.0420969 -0.3266455 0.1017894 0.1253486 1.5185002 -0.0974958 -0.2222091 0.1329123 -0.4513934 -0.0739289 -0.2082465 -0.0737588 -0.1036628 -1.06932 0.0567504 0.1347027 0.1149596 0.0459878 0.0286099 0.1906358 0.0040765 -0.0251935 0.0505083 0.0279854 -0.0131471 0.0182016 0.0678464 0.0218892 -0.0164925 0.0113188 0.0012495 0.0835338 0.0235362 0.0099317 0.0419162 0.0450828 -0.0298248 0.0341329 -0.0384028 0.164117 unknown
polarizability: 139.0026914|-4.1318311|87.322461|0.7714682|-4.146899|48.1567916 unknown
InChI: InChI=1S/C5H2Br2O2/c6-2-1-3(8)4(7)5(2)9/h1,4H
charge 0 multiplicity 1
11 atoms
Br 1.912009 -1.717908 0.916704
Br -3.045069 0.704759 0.432436
O  -1.231041 -1.884964 -0.525069
O  2.203061 1.528801 -0.273381
C  0.921849 -0.611422 -0.446731
C  -0.599365 -0.831392 -0.312484
C  1.126341 0.893251 -0.184615
C  -1.173628 0.50055 0.102294
C  -0.203899 1.468126 0.171575
H  1.317485 -0.942754 -1.419805
H  -0.334342 2.521456 0.425975
