program: Gaussian 09
title: 000242450
version: EM64L-G09RevD.01
frameworkgroup: C1[X(C9H11N3O2S)]
method: RPBEPBE
basis: SDD
operation: Freq
keyword: #p
keyword: freq=noraman
keyword: PBEPBE/SDD
title: #p freq=noraman PBEPBE/SDD
converged: YES YES NO NO
title: Mulliken charges:
elementType: S O O N N N C C C C C C C C C H H H H H H H H H H H
charge: 0.271627 -0.227712 -0.248187 -0.118392 0.037630 0.068681 -0.397886 -0.421170 0.174626 -0.396294 0.060780 -0.454946 0.188088 -0.826227 -0.502216 0.247191 0.250918 0.244290 0.249847 0.280883 0.270508 0.279504 0.242081 0.241522 0.242759 0.242094
chargesum: 0.00000
title: Mulliken charges with hydrogens summed into heavy atoms:
elementType: S O O N N N C C C C C C C C C
charge: 0.271627 -0.227712 -0.248187 -0.118392 0.037630 0.068681 0.100223 0.072967 0.174626 -0.115411 0.060780 -0.454946 0.188088 -0.034134 0.224160
polarizability: 1.96775516e+02 1.87235998e+00 1.89120577e+02 2.12358335e+00 3.56868762e+00 7.28219475e+01
1716.lowfreq: -2.8492 -0.0016 -0.0016 0.0023 2.1253 8.2344 31.5233 61.7632 63.3511
frequency: 31.4808 61.7600 63.3493 85.3635 97.7285 102.8658 112.0083 126.2326 134.1266 168.1367 197.4679 209.2748 246.9898 266.4045 300.5318 338.1959 385.5182 436.0991 486.5620 521.1177 572.0941 643.8954 663.2647 706.2361 735.4227 767.0874 772.9863 799.4010 823.7944 905.7284 908.9046 922.2539 932.3436 961.9402 978.1444 994.8591 1001.5448 1091.3601 1095.0061 1107.0635 1112.4354 1118.9770 1137.7432 1149.3707 1168.5883 1230.4686 1255.6788 1282.3030 1332.1808 1348.1663 1420.9653 1434.4889 1449.0240 1452.9553 1456.8729 1460.2143 1462.9908 1478.7783 1496.5102 1550.5443 1607.3719 3005.0645 3021.9508 3073.7690 3085.0324 3106.5456 3145.4153 3152.9924 3155.8810 3180.7005 3192.9343 3197.3303
redmass: 5.7862 3.0827 3.4477 2.5492 1.7180 2.3319 1.1825 3.0019 3.8431 4.9820 3.7044 5.1595 5.2185 4.6047 6.2770 5.5951 7.8357 7.2279 8.1361 9.3706 5.7942 6.7468 7.2022 7.1527 11.2378 6.1155 4.1896 1.0504 8.7912 3.4531 2.1951 8.1076 4.8760 3.3480 1.1808 1.3299 1.1292 1.3934 1.8447 1.3412 1.2656 1.4523 1.4439 1.4792 4.0926 8.5010 4.9146 5.2356 3.0765 1.3241 1.2411 1.0532 1.2039 1.0513 2.0423 1.1787 1.0998 1.5889 5.3372 6.4272 9.9809 1.0297 1.0283 1.0507 1.0584 1.1044 1.1039 1.1055 1.1046 1.1182 1.0936 1.1174
irintensity: 3.0995 3.3599 3.2345 2.0860 0.6861 1.7326 0.7883 2.4061 3.3608 1.4284 1.5693 7.7787 21.4097 0.6156 3.4145 28.2053 3.2833 2.8148 5.5354 2.2023 1.6310 6.6270 0.0237 32.9928 15.0016 8.1838 8.3027 35.0469 6.8908 8.2166 23.3293 4.7050 45.8644 74.7013 8.2402 2.0450 0.5931 24.1212 66.2990 11.0603 0.0387 46.1427 0.5981 11.5570 140.3729 261.6872 66.7226 79.0661 89.1239 14.3855 29.8688 15.2541 103.5866 14.8970 194.5142 8.8237 6.9403 157.1358 184.1276 491.4696 125.0616 34.8780 22.2384 22.2486 34.8872 25.7361 11.9104 12.6224 13.4880 1.9812 3.2558 24.7940
temp: 298.150 k
press: 1.00000 atm
elementType: 16 8 8 7 7 7 6 6 6 6 6 6 6 6 6 1 1 1 1 1 1 1 1 1 1 1
symmnumber: 1
zpe: 505295.4 jmol-1
zpe.correction: 0.192457 hartree
zpe.thermalcorrener: 0.208235 hartree
zpe.thermalcorrenthalpy: 0.209179 hartree
zpe.thermalcorrgfe: 0.147588 hartree
zpe.sumelectzpe: -1061.146362 hartree
zpe.sumelectthermal: -1061.130584 hartree
zpe.sumelectthermalent: -1061.129639 hartree
zpe.sumelectthermalfe: -1061.191231 hartree
dipole: -2.4610 -2.4694 1.1754
dipole: 3.6791
quadrupole: -72.3325 -92.9940 -95.4180
quadrupole: 6.6221 -1.7607 -2.9443
quadrupole: 14.5823 -6.0791 -8.5032 6.6221 -1.7607 -2.9443
hfenergy: -1061.3388185 hartree
pointgroup: C01 [X(C9H11N3O2S1)]
dipole: -1.114913 0.7889748 -0.4792469 debye
dipolederiv: 0.0163756 -0.1618752 -0.0151922 -0.3145252 -0.6926211 0.0195272 -0.0133655 -0.0166689 -0.0713252 -1.4267375 0.2328701 0.0554437 0.5226426 -0.5797807 -0.029613 0.0718164 -0.0177567 -0.2656886 -0.800877 -0.2084361 0.016692 0.041321 -0.8385781 -0.0097462 0.0275266 0.0079669 -0.3128974 -1.2544652 0.9713914 -0.150847 0.9077886 -0.8404005 0.0279344 0.2939556 -0.3132953 -0.4548116 -0.4890363 0.4153277 -0.0004348 0.2671673 -1.4121207 0.0087418 0.0339307 -0.0547332 -0.1622796 -0.7399036 -0.7217902 0.0129326 -0.0227776 -1.1349627 -0.0005214 0.0509336 0.0137991 -0.1587062 0.3721736 -0.1513004 -0.023928 -0.1202449 0.08936 0.0184801 -0.0496777 0.0522368 0.2370723 0.1604345 -0.2432191 0.0332208 -0.2785802 0.3566463 0.0278511 -0.0242711 0.0323783 0.2612112 1.5091949 -0.9511911 -0.0180012 -0.6760856 1.1284052 0.0195477 -0.2874597 0.2577189 0.1555578 -0.8720665 0.4977253 0.0063186 -0.1062893 -0.3746073 0.033726 0.0352429 -0.0188161 -0.1206051 0.1865889 -0.0747278 -0.0094855 -0.2564783 0.8003283 0.0171217 -0.0206421 0.0325099 0.0775265 0.4701058 0.378025 -0.0152448 0.3929372 1.9098902 -0.000141 -0.0459283 0.0485817 -0.000068 1.8250951 -0.0281868 -0.0768982 -0.4538556 1.1548084 0.035388 -0.0975997 0.0114111 0.207514 0.1280436 0.0681762 -0.0011795 0.0877256 0.044295 -0.0108699 0.0012426 -0.0097199 0.0439913 0.7499595 -0.0443954 -0.0226334 0.005201 0.2130679 -0.0003698 -0.0283113 0.0033018 0.2805778 -0.0907343 0.022638 0.0555397 -0.0579324 0.1151023 -0.0233349 0.0989706 -0.0265952 0.0394935 0.0121492 0.0142806 0.0177449 -0.0267638 0.0251461 -0.1126166 -0.0871645 -0.0378696 -0.0051832 0.0364899 0.0167501 0.1058125 0.0293861 0.02335 0.0053674 0.0013864 0.1035656 -0.0576243 0.1253524 -0.0021139 0.024263 0.0767803 -0.115515 -0.0247911 0.0306365 -0.0629051 0.0445078 0.1562151 -0.0075874 0.0054608 -0.0147293 0.0109955 -0.0047722 0.0055464 -0.0105466 0.1668425 -0.0430387 -0.0147136 -0.0612915 0.0705266 0.087344 0.0826047 -0.0473597 0.0634444 -0.0209915 -0.0172622 -0.0222053 0.0553764 0.0540133 0.0921195 -0.0880299 0.0418379 -0.0570432 -0.0279594 0.058505 -0.0650973 0.0037849 -0.0804493 -0.1228747 0.0059441 0.0027082 0.0035638 0.1278474 -0.0054091 0.0605976 0.0076936 0.1280028 -0.0369265 -0.0101269 0.010159 -0.0064022 0.1223483 -0.0364433 0.004946 -0.0006401 -0.092497 0.0517356 -0.0958844 -0.0513679 -0.0770774 -0.0529383 -0.0307095 0.0141117 -0.0045073 -0.0822837 0.0457931 0.108583 0.0472541 0.0789511 -0.053412 unknown
polarizability: 197.0987497|-0.6882231|188.806501|-3.9610433|-0.9728198|72.8127897 unknown
InChI: InChI=1S/C9H11N3O2S/c1-14-8(13)6-5-7(12-3-4-12)11-9(10-6)15-2/h5H,3-4H2,1-2H3
charge 0 multiplicity 1
26 atoms
S  -0.762637 -3.424064 -0.007355
O  3.400669 -0.410444 -0.140953
O  2.752992 1.823889 -0.083749
N  -2.395446 1.401225 0.373835
N  -1.580345 -0.804365 0.128424
N  0.814454 -1.26063 -0.030308
C  -3.712135 1.318411 -0.289249
C  -2.802035 2.543533 -0.483625
C  -1.318094 0.540531 0.18185
C  0.014403 1.041618 0.117085
C  1.046326 0.088251 0.005919
C  -0.497431 -1.626802 0.039134
C  2.462303 0.600259 -0.076495
C  -2.635003 -3.505932 0.143071
C  4.812073 0.039694 -0.220695
H  -4.583457 1.391835 0.368424
H  -3.810025 0.613492 -1.123127
H  -2.303057 2.654647 -1.454785
H  -3.030871 3.477815 0.037975
H  0.242876 2.108042 0.15891
H  -3.102962 -3.01182 -0.719678
H  -2.955798 -3.015242 1.072374
H  -2.879015 -4.579834 0.160486
H  5.394096 -0.89027 -0.270953
H  5.074742 0.629729 0.67352
H  4.965079 0.658629 -1.120836
