program: Gaussian 09
title: 000242448
version: EM64L-G09RevD.01
frameworkgroup: C1[X(C13H12ClN3S)]
method: RPBEPBE
basis: SDD
operation: Freq
keyword: #p
keyword: freq=noraman
keyword: PBEPBE/SDD
title: #p freq=noraman PBEPBE/SDD
converged: NO YES NO NO
title: Mulliken charges:
elementType: Cl S N N N C C C C C C C C C C C C C H H H H H H H H H H H H
charge: -0.010048 0.285086 -0.131797 0.030986 0.121290 -0.397835 -0.405343 0.055027 0.232520 0.327661 -0.371248 -0.445107 -0.369302 -0.388254 -0.237408 -0.224927 -0.240055 -0.825210 0.241994 0.248435 0.250529 0.253212 0.258063 0.255819 0.230070 0.229465 0.231096 0.271192 0.280414 0.243674
chargesum: 0.00000
title: Mulliken charges with hydrogens summed into heavy atoms:
elementType: Cl S N N N C C C C C C C C C C C C C
charge: -0.010048 0.285086 -0.131797 0.030986 0.121290 0.092594 0.098398 0.055027 0.232520 0.327661 -0.371248 -0.445107 -0.111239 -0.132435 -0.007338 0.004537 -0.008959 -0.029930
polarizability: 2.95651287e+02 -1.32403800e+00 1.91937898e+02 -3.07789374e+00 1.34690301e+01 1.10502448e+02
1716.lowfreq: -4.0157 -1.6601 0.0015 0.0023 0.0031 7.8283 31.4586 56.7501 68.4562
frequency: 31.3642 56.6774 68.4553 72.1403 86.4097 101.2417 120.6540 129.1649 157.2115 171.8257 177.3685 219.1634 234.7502 253.1774 269.3501 337.8193 388.3363 403.2051 408.3210 446.0243 483.4454 517.9680 597.5038 611.8105 616.7169 658.6314 663.4441 683.6481 703.4676 741.7808 772.8934 782.3947 793.7767 795.8124 855.9829 911.2216 926.3137 936.4573 967.5268 979.5603 979.8392 989.2472 994.3040 996.8463 1001.4329 1031.2264 1081.7695 1091.7050 1106.4069 1118.2700 1134.9207 1173.6083 1174.1756 1192.9726 1200.5598 1222.9945 1273.0027 1319.2233 1335.9695 1354.4787 1371.0916 1405.6165 1433.6562 1435.6476 1452.3454 1462.5106 1474.1230 1479.7402 1484.5463 1527.5992 1582.7111 1610.5071 3023.1643 3079.1357 3086.6183 3125.7429 3134.3701 3146.8955 3147.5178 3154.1786 3155.9357 3167.5719 3182.9862 3198.7674
redmass: 6.0352 3.8405 5.0696 3.9108 3.1615 3.8806 1.1599 3.0417 5.1918 6.4464 6.2613 5.4636 6.0098 6.4913 5.5906 6.1978 7.5178 3.0125 5.7565 9.5521 6.4722 5.0561 9.9416 6.1917 6.8709 10.1364 7.1291 7.1252 1.8060 4.3684 2.9764 5.0741 1.2177 4.0657 1.2448 6.9574 1.4588 4.4817 4.5191 1.1796 1.4012 5.5233 1.2736 1.3166 1.1640 2.0715 1.6310 1.2992 1.3471 1.4727 1.4945 1.1391 3.2767 1.1195 7.2089 5.6937 10.2286 1.4072 1.8812 1.9494 6.4841 6.0698 2.3672 1.0616 1.0657 1.0767 2.2984 2.3817 2.1538 9.1289 5.9726 6.0477 1.0282 1.0485 1.0606 1.0847 1.0881 1.1040 1.0927 1.1055 1.0965 1.1015 1.1187 1.1175
irintensity: 0.2143 0.6003 0.6527 2.2701 1.7919 2.9816 0.3669 1.2356 0.6283 0.1759 2.6678 1.6023 4.3839 12.3621 3.9742 3.9968 0.9533 0.1367 0.7418 4.9325 12.4311 4.7649 1.2549 5.7855 0.7219 3.1119 0.4049 6.4075 43.2010 47.9647 15.2928 28.2573 42.0108 72.5438 0.0342 16.5730 5.6942 58.7635 17.7490 8.0812 0.0781 0.4625 1.7431 0.4553 1.4436 14.0963 6.8940 3.6095 5.8363 40.3503 4.8482 5.1817 43.9634 2.4831 143.3102 26.0546 2.3470 5.7382 161.4078 188.6154 2.6124 143.9912 25.8832 16.4760 24.1729 2.9695 247.4296 330.6245 60.3189 370.9381 5.3429 4.7865 23.2746 16.2168 33.1173 1.1039 5.1335 12.6919 21.9883 11.6845 23.6540 18.5823 0.6358 19.5054
temp: 298.150 k
press: 1.00000 atm
elementType: 17 16 7 7 7 6 6 6 6 6 6 6 6 6 6 6 6 6 1 1 1 1 1 1 1 1 1 1 1 1
symmnumber: 1
zpe: 581558.3 jmol-1
zpe.correction: 0.221504 hartree
zpe.thermalcorrener: 0.238536 hartree
zpe.thermalcorrenthalpy: 0.239480 hartree
zpe.thermalcorrgfe: 0.175317 hartree
zpe.sumelectzpe: -1523.625723 hartree
zpe.sumelectthermal: -1523.608690 hartree
zpe.sumelectthermalent: -1523.607746 hartree
zpe.sumelectthermalfe: -1523.671909 hartree
dipole: 1.8270 5.7870 -1.2857
dipole: 6.2032
quadrupole: -106.1808 -119.3777 -116.0357
quadrupole: -6.9632 -0.9810 0.9107
quadrupole: 7.6839 -5.5129 -2.1710 -6.9632 -0.9810 0.9107
hfenergy: -1523.8472267 hartree
pointgroup: C01 [X(C13H12Cl1N3S1)]
dipole: 0.507988 -2.3870067 0.0191777 debye
polarizability: 293.1009967|-11.5973761|182.757948|18.3878132|28.7332591|122.2326888 unknown
InChI: InChI=1S/C13H12ClN3S/c1-18-13-15-11(14)10(9-5-3-2-4-6-9)12(16-13)17-7-8-17/h2-6H,7-8H2,1H3
charge 0 multiplicity 1
30 atoms
Cl 0.510201 3.1530 0.780096
S  -4.426009 1.363086 -0.162419
N  -0.486202 -1.823299 -0.686925
N  -2.251287 -0.305773 -0.377363
N  -1.855836 1.989996 0.280885
C  -1.184406 -3.084436 -0.358984
C  0.244803 -2.821044 0.138279
C  -0.903072 -0.546754 -0.314336
C  0.057554 0.468723 0.052052
C  1.521578 0.190671 0.087594
C  -0.541995 1.722704 0.336644
C  -2.66314 0.951725 -0.086364
C  2.177893 -0.335633 -1.058471
C  2.289232 0.443974 1.256114
C  3.56642 -0.58901 -1.039043
C  3.676588 0.183131 1.27687
C  4.322208 -0.33189 0.128795
C  -5.139163 -0.285785 -0.716303
H  -1.346321 -3.769618 -1.19669
H  -2.00399 -3.026913 0.366898
H  0.381907 -2.597185 1.202961
H  1.09597 -3.30586 -0.349288
H  1.596391 -0.538381 -1.964025
H  1.798521 0.848577 2.147462
H  4.058059 -0.98208 -1.935996
H  4.252482 0.385399 2.186783
H  5.400145 -0.528011 0.143463
H  -4.940508 -1.054793 0.043059
H  -4.690166 -0.582313 -1.674253
H  -6.221258 -0.112808 -0.825795
