program: Gaussian 09
title: 000242441
version: EM64L-G09RevD.01
frameworkgroup: C1[X(C16H16O2)]
method: RPBEPBE
basis: SDD
operation: Freq
keyword: #pfreq=noraman
keyword: PBEPBE/SDD
title: #p freq=noraman PBEPBE/SDD
converged: YES YES NO NO
title: Mulliken charges:
elementType: O O C C C C C C C C C C C C C C C C H H H H H H H H H H H H H H H H
charge: -0.432452 -0.214400 0.082869 -0.612507 0.431639 -0.782452 0.502338 0.152296 -0.387610 -0.386477 -0.423366 -0.387537 -0.252817 -0.246222 -0.240064 -0.237967 -0.234389 -0.244437 0.247768 0.218479 0.239532 0.249120 0.220816 0.268180 0.251250 0.230325 0.251423 0.226023 0.225439 0.229430 0.224087 0.224954 0.379263 0.227468
chargesum: 0.00000
title: Mulliken charges with hydrogens summed into heavy atoms:
elementType: O O C C C C C C C C C C C C C C C C
charge: -0.053190 -0.214400 0.082869 -0.146260 0.431639 -0.072984 0.502338 0.152296 -0.119430 -0.135227 -0.193041 -0.136113 -0.026794 -0.020784 -0.010634 -0.013880 -0.009435 -0.016969
polarizability: 1.76896311e+02 2.71414582e+00 1.89514057e+02 -2.03241027e+01 -6.06092840e+00 1.36257426e+02
1716.lowfreq: -9.1211 -2.3615 -0.0007 -0.0005 -0.0004 5.5542 25.5530 41.7845 53.5247
frequency: 25.1579 41.6003 53.5010 55.6684 81.0770 114.2443 158.7963 198.5658 227.8054 243.4108 280.3363 292.7874 330.0027 350.1287 377.9905 404.0431 405.9253 442.6138 473.8680 498.5245 526.7236 565.4832 611.1746 617.0125 617.5460 618.7059 689.4633 704.2325 705.3615 712.0848 756.9892 775.3464 799.8222 838.4409 853.6624 856.8667 895.3416 915.9265 927.2059 935.2786 976.5739 982.0334 990.5245 991.0652 994.5135 998.0904 1022.8554 1026.8401 1028.4310 1060.9710 1083.0908 1090.3901 1129.2461 1147.3907 1162.5366 1171.8810 1175.4488 1190.2596 1201.7518 1217.5670 1260.9333 1276.9374 1316.8199 1328.2869 1333.0957 1377.9496 1382.5110 1396.9004 1434.1427 1439.6428 1467.2153 1477.8685 1482.8139 1484.7185 1485.7692 1589.2896 1591.3958 1608.8475 1613.3396 1648.9949 3001.7832 3005.0962 3074.6617 3093.8427 3112.5576 3114.6083 3123.3806 3123.7139 3133.4032 3135.6125 3145.9895 3148.1801 3159.5234 3162.2461 3172.8058 3504.0833
redmass: 4.2435 4.1488 9.1819 4.5247 4.7311 4.5618 4.9788 5.0160 3.8116 2.9553 3.4100 1.2410 3.7937 4.0532 2.0935 2.8129 2.8246 3.7571 3.7054 3.4012 3.3068 4.9295 1.4023 5.3235 4.9474 4.5691 4.8596 2.3660 1.8136 2.2671 1.8635 2.3715 3.1495 2.7172 1.2492 1.2551 2.1398 1.7113 1.5851 1.5722 1.3938 1.4623 5.6731 4.4623 1.3365 1.3565 2.9680 2.6039 2.2142 1.6626 1.8165 1.6592 1.8801 2.2842 2.0290 1.0617 1.0722 1.1263 1.1300 2.6791 1.9207 2.0135 1.3948 1.4120 1.2706 6.8130 7.0802 1.2007 2.1947 2.1426 1.0985 1.2068 1.3356 1.7510 1.5570 5.9202 5.9674 5.9475 6.1203 8.6816 1.0394 1.0602 1.0985 1.0985 1.0994 1.0883 1.0861 1.0849 1.0886 1.0917 1.0960 1.0933 1.0972 1.1015 1.0967 1.0639
irintensity: 0.0755 0.0747 0.7523 0.0254 0.3244 0.2844 0.4786 0.0402 0.8535 0.5534 0.1680 0.7807 5.1012 1.9676 1.0360 0.0411 0.0873 2.8364 9.9250 1.9610 25.7351 17.2350 117.3890 5.6982 11.3039 16.7246 2.7144 31.5937 56.7143 58.1568 15.6459 40.8659 11.0262 12.4856 0.3395 0.5354 5.4472 1.5339 2.4611 10.8770 0.1933 2.3093 0.0967 4.0567 0.4107 1.5770 190.2368 36.7913 5.8484 19.3209 5.7783 9.0442 21.2575 19.6563 5.8162 0.0522 0.3738 1.4273 1.5348 0.5268 9.9328 11.0913 3.6307 1.1321 1.0412 0.2273 0.3204 26.5199 8.3723 9.5045 4.8718 22.7390 18.5587 8.8853 18.4954 1.2612 1.0927 13.1507 5.0124 236.4950 13.1914 24.8941 9.0410 26.2735 21.0267 3.1299 0.6073 0.5202 10.6590 17.0177 40.6896 15.4680 29.8071 21.6651 10.2137 23.6655
temp: 298.150 k
press: 1.00000 atm
elementType: 8 8 6 6 6 6 6 6 6 6 6 6 6 6 6 6 6 6 1 1 1 1 1 1 1 1 1 1 1 1 1 1 1 1
symmnumber: 1
zpe: 722718.7 jmol-1
zpe.correction: 0.275269 hartree
zpe.thermalcorrener: 0.291263 hartree
zpe.thermalcorrenthalpy: 0.292208 hartree
zpe.thermalcorrgfe: 0.230629 hartree
zpe.sumelectzpe: -768.470348 hartree
zpe.sumelectthermal: -768.454354 hartree
zpe.sumelectthermalent: -768.453409 hartree
zpe.sumelectthermalfe: -768.514988 hartree
dipole: -0.6385 0.8720 -1.0300
dipole: 1.4930
quadrupole: -105.0918 -97.8333 -104.1351
quadrupole: 3.6681 -11.1346 4.0052
quadrupole: -2.7384 4.5201 -1.7817 3.6681 -11.1346 4.0052
hfenergy: -768.745617 hartree
pointgroup: C01 [X(C16H16O2)]
dipole: -0.2877811 0.3035471 -0.4123925 debye
polarizability: 174.3022159|0.1923818|188.456052|-22.2756634|-10.5878263|139.9095266 unknown
InChI: InChI=1S/C16H16O2/c1-16(15(17)18,14-10-6-3-7-11-14)12-13-8-4-2-5-9-13/h2-11,17H,12H2,1H3
charge 0 multiplicity 1
34 atoms
O  2.17179 -2.183309 -1.385778
O  2.816267 -2.463564 0.815808
C  0.790213 -1.088132 0.333297
C  -0.393035 -1.432578 -0.660083
C  1.24129 0.390522 0.15454
C  0.381932 -1.420551 1.787494
C  -1.71173 -0.746839 -0.331674
C  2.0126 -1.969367 -0.003152
C  1.729345 0.840199 -1.103072
C  1.164623 1.32501 1.216318
C  -2.733281 -1.442448 0.366955
C  -1.963029 0.593025 -0.729908
C  2.117487 2.18333 -1.292929
C  1.551365 2.67193 1.027542
C  2.028207 3.1094 -0.227359
C  -3.965883 -0.819878 0.668382
C  -3.192901 1.220142 -0.429535
C  -4.19959 0.517123 0.272347
H  -0.071645 -1.176115 -1.683398
H  -0.534308 -2.530093 -0.639571
H  -0.479415 -0.808045 2.099681
H  1.221296 -1.261455 2.48379
H  0.086487 -2.481832 1.863408
H  1.816612 0.132578 -1.934426
H  0.798809 1.014051 2.198575
H  -2.562932 -2.482899 0.671274
H  -1.191671 1.145877 -1.277802
H  2.49242 2.506029 -2.270971
H  1.47856 3.376916 1.863439
H  2.329756 4.152733 -0.372691
H  -4.742208 -1.377062 1.205256
H  -3.36717 2.254547 -0.747168
H  2.994951 -2.725396 -1.529225
H  -5.155314 1.00195 0.501435
