program: Gaussian 09
title: 000242436
version: EM64L-G09RevD.01
frameworkgroup: C1[X(C20H23NO5)]
method: RPBEPBE
basis: SDD
operation: Freq
keyword: #p
keyword: freq=noraman
keyword: PBEPBE/SDD
title: #p freq=noraman PBEPBE/SDD
converged: YES YES NO NO
title: Mulliken charges:
elementType: O O O O O N C C C C C C C C C C C C C C C C C C C C H H H H H H H H H H H H H H H H H H H H H H H
charge: -0.303936 -0.308866 -0.283675 -0.434759 -0.280598 -0.376283 -0.345366 -0.434948 -0.635247 0.469032 0.450552 0.076815 0.231331 0.070719 -0.655184 -0.661506 -0.335266 0.014695 0.225051 0.301498 -0.397893 0.226125 -0.778802 -0.526043 -0.522951 -0.523760 0.271298 0.230673 0.223027 0.226786 0.239786 0.329700 0.239315 0.266699 0.263264 0.252437 0.212386 0.252893 0.250428 0.356685 0.227107 0.245659 0.232592 0.257398 0.225759 0.229556 0.210747 0.230632 0.264436
chargesum: 0.00000
title: Mulliken charges with hydrogens summed into heavy atoms:
elementType: O O O O O N C C C C C C C C C C C C C C C C C C C C
charge: -0.303936 -0.308866 -0.283675 -0.078075 -0.280598 -0.046583 -0.074068 0.018752 -0.168674 0.469032 0.450552 0.076815 0.231331 0.070719 -0.415869 -0.394807 -0.072002 0.014695 0.225051 0.301498 -0.145456 0.226125 -0.063095 0.179316 0.189762 0.182056
polarizability: 3.30563489e+02 1.65190868e+01 2.26631581e+02 2.86118179e+00 -1.78643510e+01 1.91657267e+02
1716.lowfreq: -8.4126 -7.5031 -0.0006 0.0002 0.0006 2.3021 22.7701 28.8990 38.0303
frequency: 22.0180 28.8689 38.0228 44.7181 53.6680 62.5369 75.4005 81.5205 87.2026 95.5785 104.1411 136.5124 145.0660 154.3957 156.6858 168.3649 175.7094 195.2902 222.5886 230.5578 252.7716 263.9336 267.9542 277.2888 303.7099 330.0183 344.7281 357.3694 370.3886 381.5190 394.1832 407.8889 419.3351 460.4196 484.2028 495.7201 508.9395 529.6393 543.7452 559.9712 587.7787 601.6649 605.2114 625.0274 634.1511 653.2637 678.5706 689.3633 747.6966 767.1107 782.9244 791.2599 830.9716 838.2561 853.0431 870.0805 875.2146 888.0924 904.3342 936.0603 947.5820 954.0718 957.5529 971.3162 1007.7003 1012.5060 1038.3598 1041.8495 1073.2266 1094.8205 1099.6860 1108.6666 1110.1343 1110.9806 1123.0722 1138.7914 1151.7851 1154.9676 1157.1811 1171.1517 1184.2132 1202.5009 1220.4340 1230.6699 1250.0366 1269.0540 1279.4446 1297.4504 1306.9677 1326.7518 1338.4976 1346.1823 1355.5704 1378.8517 1385.1003 1387.3379 1414.8471 1427.6794 1431.2306 1435.6404 1451.1778 1452.5654 1456.3926 1457.6177 1461.6050 1462.9097 1463.8695 1472.9174 1474.0430 1474.7852 1480.3144 1485.4096 1503.7696 1546.6734 1590.6705 1597.7830 1612.5192 1618.1203 2967.7350 2973.2215 2978.0701 2984.2469 2992.3453 2993.2928 3032.9919 3043.1282 3057.4702 3065.8689 3080.7304 3082.1770 3095.7064 3096.9636 3108.4312 3120.1730 3121.0011 3128.6135 3151.6550 3159.1453 3179.9302 3546.7472 3578.6412
redmass: 6.0062 4.5986 4.1680 4.0758 3.3481 3.3193 2.7827 3.6575 2.9968 1.2173 2.3885 1.8075 2.0992 2.3507 1.6096 2.6690 1.1176 3.7757 4.8741 4.3293 4.7035 4.6526 3.6869 4.5479 3.9376 4.9154 4.2539 3.8064 1.1398 4.5922 5.4474 4.8796 3.4678 4.9868 3.0477 2.8887 6.2537 4.4114 2.3059 2.9040 4.3487 2.6292 3.2899 4.1489 4.6093 5.1717 5.4299 4.8653 4.0541 3.2719 5.3584 4.1735 1.5868 2.7283 1.8993 3.4174 3.9138 1.7828 4.7665 3.1266 7.6667 1.4194 3.6054 2.4322 2.0717 4.2896 2.8457 2.0414 2.3929 2.2044 3.0987 1.2395 1.3084 1.2493 2.1217 1.5953 1.3589 1.4336 1.4461 1.4527 1.3259 1.8270 1.3477 2.0266 1.7364 2.9054 1.5707 1.8009 3.1622 1.4145 2.5178 2.1430 3.0384 2.2273 1.2365 2.9999 1.3191 1.5931 1.7806 1.4008 1.0513 1.3858 1.1052 1.0575 1.5812 1.1673 1.2945 1.2033 1.1144 1.2646 1.0558 1.0543 3.2177 8.1969 6.7515 7.3642 6.3140 6.4543 1.0307 1.0348 1.0299 1.0597 1.0626 1.0361 1.0872 1.0971 1.1028 1.1046 1.1042 1.0976 1.1007 1.0980 1.0912 1.1020 1.1035 1.1047 1.0915 1.0882 1.0972 1.0782 1.0660
irintensity: 6.4233 0.9392 1.8720 2.5531 2.5097 7.4239 6.1695 5.3199 2.8193 1.2172 2.0424 0.2357 2.1295 0.1797 1.2415 2.0135 0.1282 4.1995 5.3134 7.4021 1.8523 11.2778 4.2444 1.5791 4.8537 4.5239 3.5544 3.5570 133.3827 5.1742 7.0804 6.3216 3.7642 7.1535 13.4105 10.4260 15.5073 3.9128 49.5152 19.7293 1.2645 9.5699 10.9820 0.7096 6.5295 6.7314 4.8242 1.3860 10.6002 26.2974 0.9921 8.8802 17.1464 3.7669 31.9969 17.5475 5.0038 25.3033 20.7645 21.3272 71.8551 0.8690 30.4388 2.4711 24.8911 49.6688 50.4625 52.4438 18.6049 12.7182 28.9560 16.2296 0.8702 1.7808 18.0120 278.9992 4.0441 3.6685 35.1035 8.1968 14.4343 39.5450 15.1281 14.8088 55.3292 83.9875 16.9816 20.9233 51.2963 36.6336 7.0843 49.5784 26.9639 42.0452 62.8648 83.3688 13.4574 26.4943 25.2310 31.7649 16.6299 29.3652 7.4026 6.8242 61.3395 41.5139 158.2816 34.4602 13.3438 80.2363 19.4607 23.6970 19.6279 22.8197 14.8098 26.5491 208.4490 107.0301 49.5529 101.3999 67.1890 28.0841 37.6991 8.7701 1.2932 34.2916 30.9135 30.3167 18.6999 35.5878 22.2792 7.9553 14.0634 19.6556 24.2187 16.6329 4.4552 4.5801 6.9330 35.7847 54.0780
temp: 298.150 k
press: 1.00000 atm
elementType: 8 8 8 8 8 7 6 6 6 6 6 6 6 6 6 6 6 6 6 6 6 6 6 6 6 6 1 1 1 1 1 1 1 1 1 1 1 1 1 1 1 1 1 1 1 1 1 1 1
symmnumber: 1
zpe: 1028118.2 jmol-1
zpe.correction: 0.391590 hartree
zpe.thermalcorrener: 0.418055 hartree
zpe.thermalcorrenthalpy: 0.418999 hartree
zpe.thermalcorrgfe: 0.333883 hartree
zpe.sumelectzpe: -1204.846647 hartree
zpe.sumelectthermal: -1204.820181 hartree
zpe.sumelectthermalent: -1204.819237 hartree
zpe.sumelectthermalfe: -1204.904353 hartree
dipole: 3.2450 0.1157 0.2094
dipole: 3.2538
quadrupole: -148.2234 -155.2471 -149.2646
quadrupole: 1.2985 15.6455 -7.1489
quadrupole: 2.6883 -4.3354 1.6471 1.2985 15.6455 -7.1489
hfenergy: -1205.2382361 hartree
pointgroup: C01 [X(C20H23N1O5)]
dipole: -1.2730964 0.0574831 -0.1213444 debye
polarizability: 330.0538682|-17.9340433|225.1993013|6.6584633|18.763743|193.5991677 unknown
InChI: InChI=1S/C20H23NO5/c1-11(22)21-16-8-5-12-9-17(24-2)19(25-3)20(26-4)18(12)14-7-6-13(23)10-15(14)16/h6-7,9-10,16,21,23H,5,8H2,1-4H3
charge 0 multiplicity 1
49 atoms
O  -1.018223 -1.762955 -1.345643
O  -3.696662 -0.927158 -1.097637
O  -4.4165 0.831788 1.112652
O  5.082523 -2.192899 0.1177
O  2.847371 3.124256 -1.442996
N  1.044026 2.153924 -0.330452
C  1.87189 1.592177 0.762102
C  1.272096 1.930602 2.161411
C  0.263397 0.881522 2.706716
C  2.131037 0.0912 0.568101
C  -0.766882 0.429036 1.684245
C  -0.362748 -0.431921 0.612012
C  1.064049 -0.856128 0.474244
C  -1.362552 -0.866294 -0.303907
C  3.469741 -0.34494 0.448535
C  -2.108774 0.854104 1.782853
C  1.392004 -2.222755 0.258588
C  -2.722751 -0.46581 -0.179315
C  -3.094853 0.425321 0.863702
C  3.767892 -1.711857 0.24442
C  2.724648 -2.65898 0.150617
C  1.603691 2.871645 -1.375439
C  0.620846 3.350793 -2.441872
C  -0.981476 -1.141551 -2.688901
C  -4.019549 -2.369728 -0.96085
C  -5.180851 1.405416 -0.017443
H  2.835975 2.121986 0.661663
H  0.795748 2.927225 2.0911
H  2.10204 2.019001 2.888689
H  -0.243165 1.303404 3.593762
H  0.836592 -0.00155 3.048697
H  0.045019 1.941385 -0.335064
H  4.278784 0.396804 0.489068
H  -2.425607 1.513813 2.597098
H  0.582237 -2.951788 0.173084
H  2.971324 -3.712156 -0.010666
H  -0.420987 3.036411 -2.254926
H  0.657372 4.452577 -2.496899
H  0.942514 2.965127 -3.424745
H  5.735429 -1.451057 0.167935
H  -0.200045 -0.358419 -2.722903
H  -1.969651 -0.71711 -2.944225
H  -0.722855 -1.954814 -3.383855
H  -3.11593 -2.980245 -1.132541
H  -4.776102 -2.575359 -1.733685
H  -4.437245 -2.570694 0.043087
H  -4.711936 2.352366 -0.349031
H  -6.181965 1.609604 0.391548
H  -5.236136 0.694882 -0.857832
