program: Gaussian 09
title: 000242437
version: EM64L-G09RevD.01
frameworkgroup: C1[X(C21H25NO5)]
method: RPBEPBE
basis: SDD
operation: Freq
keyword: #p
keyword: freq=noraman
keyword: PBEPBE/SDD
title: #p freq=noraman PBEPBE/SDD
converged: YES YES NO NO
title: Mulliken charges:
elementType: O O O O O N C C C C C C C C C C C C C C C C C C C C C H H H H H H H H H H H H H H H H H H H H H H H H H
charge: -0.303944 -0.309344 -0.283827 -0.264298 -0.279171 -0.379686 -0.346373 -0.419935 -0.639362 0.440523 0.467520 0.238468 0.051638 0.075535 -0.614114 -0.661314 -0.357886 0.010667 0.225870 0.331036 -0.403936 0.227630 -0.779861 -0.525997 -0.522666 -0.524765 -0.536265 0.277495 0.229897 0.223167 0.226702 0.237442 0.331485 0.269151 0.266231 0.259590 0.241526 0.251709 0.250498 0.210734 0.225164 0.248786 0.230437 0.254451 0.225576 0.230457 0.212182 0.230339 0.263868 0.245812 0.221174 0.219985
chargesum: 0.00000
title: Mulliken charges with hydrogens summed into heavy atoms:
elementType: O O O O O N C C C C C C C C C C C C C C C C C C C C C
charge: -0.303944 -0.309344 -0.283827 -0.264298 -0.279171 -0.048201 -0.068878 0.033129 -0.175218 0.440523 0.467520 0.238468 0.051638 0.075535 -0.344963 -0.395083 -0.098295 0.010667 0.225870 0.331036 -0.162410 0.227630 -0.066921 0.178390 0.187817 0.181624 0.150706
polarizability: 3.56701421e+02 1.26389715e+01 2.41527590e+02 -3.33841698e-01 -1.82158355e+01 1.98063055e+02
1716.lowfreq: -7.9067 -0.0007 -0.0005 0.0006 3.5316 5.7448 15.1330 31.2582 35.7341
frequency: 14.7198 31.2481 35.6750 45.9959 50.7268 63.1362 75.0340 82.5758 87.6583 91.1776 96.4811 105.4856 135.8198 145.8629 152.5045 163.0368 166.5967 169.2294 190.4568 204.5009 221.7518 236.0232 242.7052 259.4332 271.7154 276.0084 287.9247 295.6141 330.6541 353.8923 358.7767 383.9186 400.1798 419.4370 427.8392 475.7458 487.3473 500.1113 526.7431 532.5189 546.7783 562.0000 590.0473 602.6926 605.2139 625.1037 632.7012 653.1349 679.0374 690.4487 742.0786 767.6238 774.2302 787.8896 814.8170 836.6197 857.0898 871.4859 886.6696 890.1202 902.5231 917.2127 938.0138 947.6162 956.5944 969.3985 1004.3160 1007.5302 1011.3716 1038.2277 1041.1990 1070.9623 1098.1960 1099.2161 1110.6056 1112.3509 1112.7348 1113.4332 1131.9907 1146.6196 1152.1957 1155.8781 1158.9204 1171.2934 1180.7674 1199.8378 1216.1272 1229.2081 1246.7674 1257.0715 1275.2476 1291.0893 1306.2748 1330.6725 1335.3309 1345.6869 1351.4568 1366.0628 1382.7209 1384.4861 1415.8586 1427.8374 1430.6334 1436.6563 1440.7734 1449.8612 1450.8429 1454.7350 1459.1500 1460.3273 1461.5580 1464.8928 1465.9528 1467.5897 1473.7480 1474.1249 1475.5571 1480.7385 1486.0528 1499.6752 1545.6765 1569.6198 1595.2127 1615.2809 1621.5850 2959.1572 2968.7570 2973.1983 2977.2770 2983.5991 2990.8156 2992.4434 3035.7996 3043.3180 3046.8647 3057.5629 3068.2961 3079.4239 3081.1105 3094.2501 3097.5547 3119.5951 3120.9424 3125.0683 3128.0401 3150.7803 3150.9009 3151.8650 3173.9174 3545.8607
redmass: 6.8841 4.6746 4.3539 3.5874 3.1280 3.2466 3.1505 2.5007 3.1780 1.3920 3.2910 2.4531 2.2124 2.5141 2.6736 1.1222 1.6786 1.2851 2.6989 4.5882 2.3656 6.0801 1.7302 3.7753 3.0517 4.9105 3.9152 3.5121 4.9509 3.3891 5.2455 4.8517 6.3763 3.4455 4.7057 3.8084 3.1020 4.0086 4.7296 4.2680 2.6450 2.6831 3.8185 4.1659 2.1298 4.3884 4.2777 5.0999 5.1107 4.8906 4.5769 3.6482 4.0893 3.6180 1.7466 2.8783 3.8871 4.4903 1.7470 2.2498 2.4751 3.8808 1.3985 8.0782 4.0094 2.4403 4.7121 2.0251 4.3671 2.9681 2.0003 2.4236 2.7037 3.2806 1.2535 1.2780 1.2498 1.2600 2.1053 1.4632 1.3561 1.4467 1.4733 1.3392 1.4466 1.8248 1.5172 1.9940 1.7392 3.0203 1.8567 1.3741 3.0800 1.4503 2.2252 2.2238 2.8704 2.6369 3.3531 1.2348 1.3209 1.7697 1.4687 1.2399 1.4755 1.3391 1.0877 1.2593 1.0563 1.1692 1.2476 1.2225 1.1508 1.0499 1.2054 1.0981 1.2807 1.0559 1.0549 3.1228 8.1112 7.3608 7.5878 6.3353 6.7225 1.0330 1.0309 1.0343 1.0298 1.0595 1.0625 1.0361 1.0884 1.0961 1.1039 1.1029 1.1041 1.1047 1.0985 1.1003 1.0981 1.1024 1.1033 1.0993 1.1045 1.0915 1.0916 1.0879 1.0960 1.0782
irintensity: 5.7599 0.7820 0.8905 5.4737 0.9178 6.0741 5.6127 1.6436 6.8854 0.7145 4.7283 2.3387 1.7487 0.7994 0.3178 0.0609 2.7603 2.0011 5.1809 9.6828 5.7426 0.4137 3.6042 12.7529 1.6960 3.2745 2.4861 2.1523 2.2328 1.3777 6.2646 1.4247 2.2018 4.0191 2.6480 4.3956 4.9064 23.5532 8.8984 1.9776 35.9067 30.7748 4.5952 11.6620 7.8069 0.6269 4.4491 7.7089 3.9489 1.4534 8.3999 12.0097 15.6659 13.4799 23.6460 3.5349 14.8876 3.2034 38.6933 7.1742 21.3582 14.3009 1.7120 69.6394 26.0603 2.8256 60.5091 18.2376 79.2900 57.4358 55.3581 19.1956 10.8163 22.1507 0.5883 1.8075 17.4213 0.2224 36.6197 11.4263 1.9181 4.2561 23.9766 10.2569 25.5061 41.0541 58.8976 38.6492 46.8090 225.7796 25.1453 12.7758 52.2133 40.1403 23.1835 51.2724 38.3502 16.0949 41.5807 63.1033 25.7124 34.6198 21.2286 16.3284 14.8035 31.5935 13.9675 42.4956 16.5542 33.6780 37.2771 132.1510 57.7099 14.0732 55.6463 29.0847 88.1538 22.3659 22.5816 24.1868 10.4037 72.3054 22.0519 210.6339 123.7279 82.5050 51.3104 102.4766 63.6300 22.6034 43.3804 9.9036 0.6646 29.4771 48.0483 34.9907 29.6069 19.4305 33.7922 22.1757 9.8107 19.5560 26.0621 27.7016 17.8326 5.8000 3.3772 8.9344 9.3899 45.2979
temp: 298.150 k
press: 1.00000 atm
elementType: 8 8 8 8 8 7 6 6 6 6 6 6 6 6 6 6 6 6 6 6 6 6 6 6 6 6 6 1 1 1 1 1 1 1 1 1 1 1 1 1 1 1 1 1 1 1 1 1 1 1 1 1
symmnumber: 1
zpe: 1101279.7 jmol-1
zpe.correction: 0.419455 hartree
zpe.thermalcorrener: 0.447383 hartree
zpe.thermalcorrenthalpy: 0.448327 hartree
zpe.thermalcorrgfe: 0.359647 hartree
zpe.sumelectzpe: -1244.056808 hartree
zpe.sumelectthermal: -1244.028881 hartree
zpe.sumelectthermalent: -1244.027937 hartree
zpe.sumelectthermalfe: -1244.116616 hartree
dipole: 2.6737 -4.2842 0.6417
dipole: 5.0906
quadrupole: -149.6950 -157.4004 -154.8795
quadrupole: 21.0942 11.8065 -9.5715
quadrupole: 4.2966 -3.4088 -0.8879 21.0942 11.8065 -9.5715
hfenergy: -1244.4762634 hartree
pointgroup: C01 [X(C21H25N1O5)]
dipole: -1.1119979 -1.6290894 -0.3475508 debye
polarizability: 355.1955263|-18.2811491|241.5746766|5.5427122|19.0104342|199.5218622 unknown
InChI: InChI=1S/C21H25NO5/c1-12(23)22-17-9-6-13-10-18(25-3)20(26-4)21(27-5)19(13)15-8-7-14(24-2)11-16(15)17/h7-8,10-11,17,22H,6,9H2,1-5H3
charge 0 multiplicity 1
52 atoms
O  -1.008563 -1.835395 -1.331423
O  -3.766255 -1.317946 -1.09394
O  -4.687565 0.407648 1.065776
O  5.145612 -1.30812 0.208568
O  2.083847 3.875895 -1.298593
N  0.578958 2.329482 -0.412236
C  1.470962 1.902611 0.690498
C  0.839966 2.194185 2.087941
C  -0.047367 1.047095 2.648427
C  1.907976 0.440461 0.53355
C  -1.014453 0.457335 1.634081
C  0.956494 -0.630404 0.452339
C  -0.511592 -0.376025 0.581041
C  -1.454712 -0.951407 -0.318448
C  3.284611 0.160402 0.444085
C  -2.397255 0.721422 1.728648
C  1.44497 -1.947881 0.270003
C  -2.852464 -0.711166 -0.196458
C  -3.326167 0.156407 0.824237
C  3.751527 -1.166307 0.278057
C  2.82458 -2.232027 0.186809
C  0.959791 3.285447 -1.340544
C  -0.07221 3.587915 -2.425987
C  -1.091017 -1.281281 -2.702225
C  -3.940139 -2.775139 -0.871154
C  -5.507044 0.868886 -0.077486
C  5.678694 -2.657786 0.010624
H  2.358649 2.549529 0.574615
H  0.256581 3.130618 2.003529
H  1.656303 2.382689 2.81163
H  -0.604678 1.424706 3.524974
H  0.620068 0.2414 3.010435
H  -0.334606 1.880165 -0.492242
H  4.021122 0.969632 0.483049
H  -2.787917 1.359342 2.528023
H  0.727022 -2.768576 0.192255
H  3.155086 -3.266302 0.054113
H  -0.318913 4.663289 -2.398432
H  0.375829 3.381617 -3.413506
H  -1.003975 3.003899 -2.324763
H  -0.422982 -0.40397 -2.797252
H  -2.133261 -1.005453 -2.944548
H  -0.743293 -2.086442 -3.367231
H  -2.976049 -3.297308 -1.001558
H  -4.66267 -3.105523 -1.633247
H  -4.345189 -2.957918 0.141384
H  -5.156591 1.863196 -0.416422
H  -6.529869 0.950671 0.320386
H  -5.46436 0.147037 -0.909032
H  6.770759 -2.532501 -0.02555
H  5.321441 -3.096352 -0.941551
H  5.407211 -3.325953 0.851249
