program: Gaussian 09
title: 000242435
version: EM64L-G09RevD.01
frameworkgroup: C1[X(C11H11ClN4)]
method: RPBEPBE
basis: SDD
operation: Freq
keyword: #p
keyword: freq=noraman
keyword: PBEPBE/SDD
title: #p freq=noraman PBEPBE/SDD
converged: YES YES NO NO
title: Mulliken charges:
elementType: Cl N N N N C C C C C C C C C C C H H H H H H H H H H H
charge: -0.040303 -0.466767 -0.136443 -0.018528 -0.584178 0.456316 0.498549 -0.630727 -0.348901 0.304041 -0.424991 -0.208362 -0.810103 -0.342390 -0.128657 -0.012892 0.219284 0.310087 0.307626 0.231849 0.220647 0.222968 0.236935 0.226690 0.249224 0.338999 0.330028
chargesum: 0.00000
title: Mulliken charges with hydrogens summed into heavy atoms:
elementType: Cl N N N N C C C C C C C C C C C
charge: -0.040303 -0.156681 -0.136443 -0.018528 0.084849 0.456316 0.498549 -0.411443 -0.041275 0.304041 -0.193142 0.012285 -0.123510 -0.093166 -0.128657 -0.012892
polarizability: 2.81793230e+02 -1.67457271e+00 1.78427045e+02 -2.63711526e-01 -1.15459938e-01 6.53982830e+01
1716.lowfreq: -45.4372 -7.7855 -6.0030 -0.0012 0.0009 0.0016 1.3882 30.1830 40.8519
frequency: -45.2668 30.1756 40.8068 84.9523 150.5984 178.4533 192.3590 196.5041 210.8730 217.7516 258.9752 281.5614 369.3458 389.0063 440.8680 454.7707 475.7290 514.7046 529.7369 553.1008 567.6541 592.4162 605.0743 636.9649 661.9342 683.0131 702.0897 759.8922 761.5226 799.6907 806.5354 836.8457 869.4911 903.8234 917.3403 940.3853 973.0092 985.9972 994.4381 1004.8953 1047.0173 1090.5671 1109.0720 1153.5497 1179.5577 1186.0844 1245.8567 1276.1037 1310.7067 1338.7322 1383.2051 1397.9772 1405.3878 1431.4718 1465.7394 1472.6308 1479.5918 1485.6223 1503.5808 1553.1935 1579.4669 1606.0602 1614.2605 1623.6478 2976.2887 3057.6773 3084.7210 3094.3602 3124.8517 3148.6941 3186.6691 3203.4477 3534.6419 3562.5663 3720.7469
redmass: 1.0131 4.2774 6.3222 5.7100 5.6268 5.9624 9.1622 4.6816 4.0300 4.0182 3.9361 5.1841 3.0717 12.5157 2.7804 3.5190 1.2030 4.9989 1.1057 2.3637 7.3912 4.4249 6.8701 1.6367 3.7464 6.6533 2.0976 5.8756 4.3113 1.3752 1.9410 6.7399 1.4556 6.8684 1.3864 3.1096 2.4303 5.0738 1.3194 1.6768 1.5585 1.6162 2.6866 1.5517 1.0934 1.8435 3.3272 3.1230 1.7379 2.7335 5.1939 1.2313 2.9167 3.5349 1.7754 1.0565 2.8623 2.0107 2.3474 4.1102 3.2941 3.7153 1.9931 4.3353 1.0384 1.0955 1.0995 1.0911 1.0870 1.0965 1.0941 1.0944 1.0754 1.0444 1.1059
irintensity: 0.5058 0.3563 0.0738 0.1306 0.8489 9.0365 0.8656 0.4944 1.3778 5.4775 4.3435 11.0371 2.5982 7.7003 8.6201 1.9978 282.5589 2.1075 20.2908 4.7219 3.3948 0.2428 19.2878 52.7669 4.2634 5.8539 20.1025 2.0804 0.8872 54.3538 80.9968 53.9926 19.2749 1.9271 9.7823 56.5147 32.0108 0.7952 3.2495 1.6798 20.1504 16.4398 0.1795 44.0687 1.4605 38.0317 29.7584 28.5785 7.0311 8.5217 31.5387 11.9440 42.3742 129.7474 103.8914 14.4446 172.0782 163.4095 140.5000 1322.6637 187.4543 67.6902 344.0626 146.3211 39.6628 22.9754 13.0320 25.6976 8.2762 26.8310 0.7898 11.1617 24.8756 116.6668 49.1174
temp: 298.150 k
press: 1.00000 atm
elementType: 17 7 7 7 7 6 6 6 6 6 6 6 6 6 6 6 1 1 1 1 1 1 1 1 1 1 1
symmnumber: 1
zpe: 539557.9 jmol-1
zpe.correction: 0.205507 hartree
zpe.thermalcorrener: 0.219271 hartree
zpe.thermalcorrenthalpy: 0.220215 hartree
zpe.thermalcorrgfe: 0.163831 hartree
zpe.sumelectzpe: -1103.727837 hartree
zpe.sumelectthermal: -1103.714073 hartree
zpe.sumelectthermalent: -1103.713129 hartree
zpe.sumelectthermalfe: -1103.769512 hartree
dipole: -3.4584 0.4374 0.0595
dipole: 3.4864
quadrupole: -106.9235 -79.2715 -106.2728
quadrupole: 10.2057 -0.2945 -0.0447
quadrupole: -9.4342 18.2178 -8.7835 10.2057 -0.2945 -0.0447
hfenergy: -1103.9333437 hartree
pointgroup: C01 [X(C11H11Cl1N4)]
dipole: -1.3423466 0.2733944 0.0696349 debye
polarizability: 280.8377257|-9.4236701|178.1485889|-4.1467624|11.5701805|66.6322431 unknown
InChI: InChI=1S/C11H11ClN4/c1-7-3-2-4-8(5-7)14-10-6-9(12)15-11(13)16-10/h2-6,14H,13H2,1H3
charge 0 multiplicity 1
27 atoms
Cl 4.818023 -2.10426 -0.325631
N  -0.238091 -0.907733 -0.133651
N  1.350823 0.872604 0.019762
N  3.749182 0.370404 -0.065969
N  2.967027 2.561374 0.160269
C  -1.477878 -0.214828 -0.046496
C  -3.941824 -0.438747 -0.055803
C  -2.653398 -1.012352 -0.131819
C  -1.595381 1.190438 0.114647
C  1.075234 -0.459878 -0.108176
C  -4.048581 0.967669 0.10158
C  -2.883824 1.761081 0.186219
C  -5.182956 -1.312999 -0.116688
C  2.123908 -1.436341 -0.221455
C  3.426258 -0.926191 -0.189447
C  2.674325 1.226731 0.033982
H  -2.560824 -2.100448 -0.260062
H  -0.33059 -1.920576 -0.236529
H  -0.69142 1.795662 0.17611
H  -5.039276 1.433463 0.156176
H  -2.976141 2.846692 0.306219
H  -5.019774 -2.212728 -0.736019
H  -5.476778 -1.657268 0.893953
H  -6.041961 -0.761696 -0.537335
H  1.922554 -2.503799 -0.325658
H  3.940903 2.851897 0.174912
H  2.210457 3.23473 0.239408
