program: Gaussian 09
title: 000242426
version: EM64L-G09RevD.01
frameworkgroup: C1[X(C4H7N3O)]
method: RPBEPBE
basis: SDD
operation: Freq
keyword: #pfreq=noraman
keyword: PBEPBE/SDD
title: #p freq=noraman PBEPBE/SDD
converged: NO NO NO NO
title: Mulliken charges:
elementType: O N N N C C C C H H H H H H H
charge: -0.233488 -0.412575 -0.068776 -0.634902 -0.487245 -0.461165 0.174977 0.209825 0.244193 0.247425 0.219022 0.236350 0.324958 0.306414 0.334989
chargesum: 0.00000
title: Mulliken charges with hydrogens summed into heavy atoms:
elementType: O N N N C C C C
charge: -0.233488 -0.087617 -0.068776 0.006501 0.004373 -0.005793 0.174977 0.209825
polarizability: 8.20505666e+01 -2.24901716e+00 7.42643858e+01 8.40988729e-01 1.79724837e-01 4.00170178e+01
1716.lowfreq: -0.0013 -0.0013 -0.0010 7.4241 11.5656 18.5174 135.1717 158.4120 258.3156
frequency: 135.1511 158.4080 258.3149 329.3991 364.4548 446.9823 477.7209 490.8899 550.6171 561.9122 648.3258 668.3348 705.7572 774.3904 866.3901 927.7267 968.6712 1013.5351 1050.4111 1152.0979 1167.3005 1225.0452 1282.4339 1288.5035 1303.9671 1356.7590 1427.1226 1436.8264 1473.3237 1605.4155 1642.6563 1671.4840 2956.4936 2994.2759 3060.5327 3089.7149 3511.8620 3533.8394 3680.9275
redmass: 5.2881 2.7355 2.6073 3.8629 1.0613 2.8382 4.3967 5.2425 1.3175 2.1542 2.0328 4.7348 2.4626 2.4365 3.7957 2.7579 2.4987 1.9207 2.0656 2.4998 1.2366 1.5286 1.7881 2.0464 1.5243 1.6582 2.7554 1.0936 1.0917 1.3292 5.0699 5.0988 1.0703 1.0647 1.0936 1.0964 1.0769 1.0454 1.1031
irintensity: 8.4009 1.0261 11.1995 3.0773 108.2922 9.0234 18.1736 14.5925 164.8337 87.0239 53.3805 13.1850 76.3714 3.4175 13.8050 7.1457 8.6269 19.1931 4.4714 2.6278 11.9078 83.9787 118.8585 3.5545 2.8037 53.9961 159.8306 14.6140 3.4849 128.8820 254.3448 428.9333 56.4156 15.3419 34.5224 13.9043 15.9469 47.9623 29.9257
temp: 298.150 k
press: 1.00000 atm
elementType: 8 7 7 7 6 6 6 6 1 1 1 1 1 1 1
symmnumber: 1
zpe: 312572.1 jmol-1
zpe.correction: 0.119052 hartree
zpe.thermalcorrener: 0.126298 hartree
zpe.thermalcorrenthalpy: 0.127242 hartree
zpe.thermalcorrgfe: 0.087788 hartree
zpe.sumelectzpe: -395.505481 hartree
zpe.sumelectthermal: -395.498235 hartree
zpe.sumelectthermalent: -395.497291 hartree
zpe.sumelectthermalfe: -395.536745 hartree
dipole: 2.8134 -0.6604 0.6788
dipole: 2.9686
quadrupole: -50.2960 -44.6024 -47.2453
quadrupole: -13.5163 1.1821 -1.2980
quadrupole: -2.9148 2.7788 0.1360 -13.5163 1.1821 -1.2980
hfenergy: -395.6245331 hartree
pointgroup: C01 [X(C4H7N3O1)]
dipole: -1.0821047 -0.3645541 -0.2453276 debye
dipolederiv: -1.1153762 0.2223453 0.0034753 0.3703805 -0.6355009 0.0401212 -0.0781906 0.0690951 -0.3684188 -1.4857685 0.2084117 0.017115 -0.1722863 -0.4633796 -0.0438811 0.0917076 -0.0184964 -0.3143758 -0.592399 0.0389213 0.0460145 -0.2224218 -1.0880317 -0.0436269 -0.019302 0.0536996 -0.3939597 -0.9585696 -0.5443446 -0.0296805 -0.4904414 -0.7370125 0.1534663 0.0547504 0.23727 -0.6529221 -0.0827445 0.0087183 0.0315523 0.0518155 -0.3053571 0.0707228 0.0411812 0.0683606 0.0685271 0.311866 0.1842281 0.0217943 0.1194337 0.4350232 0.0514681 -0.0263034 0.0120246 0.3042107 1.7707196 -0.1893805 -0.0630596 0.1128359 0.7625508 -0.1867923 -0.0464256 -0.1784284 0.2211635 1.5677178 0.1603733 0.0741057 0.1711849 1.5096827 0.0223247 0.1655065 -0.0464575 0.201924 -0.091063 -0.0941327 -0.0288812 -0.0366229 0.063416 -0.0130574 -0.0350983 -0.0311737 0.1046351 0.1086381 0.0307239 -0.0399512 0.0103365 0.063291 -0.0159807 0.0191097 -0.0002658 -0.0985619 -0.0117658 -0.1233038 -0.045573 -0.0180161 0.0547064 0.0012622 -0.0580295 -0.1018701 -0.1713251 0.0438546 0.0267195 -0.006524 -0.0015657 -0.1621318 0.0396175 0.0137485 0.091921 0.0738886 0.1167286 0.0124154 0.0189859 0.000728 0.1249938 0.046473 -0.0170901 0.0713184 0.3316274 0.1930678 0.024762 0.0191514 0.0637276 0.2095277 -0.0804376 -0.0508919 -0.1850172 0.3302783 0.2250938 0.0335429 -0.0185249 0.0409117 0.1682217 -0.0416799 -0.0546727 -0.0419803 0.3633086 unknown
polarizability: 81.5651958|2.9504773|74.7678869|-0.0083393|-0.0762278|39.9988875 unknown
InChI: InChI=1S/C4H7N3O/c5-4-6-2-1-3(8)7-4/h7H,1-2,5H2
charge 0 multiplicity 1
15 atoms
O  2.347157 -1.083024 0.056292
N  0.024931 -1.024058 0.130437
N  -1.293877 1.00662 0.043143
N  -2.335939 -1.111794 -0.035594
C  1.192863 1.062205 -0.409752
C  -0.020578 1.734224 0.283676
C  1.278369 -0.42071 -0.054428
C  -1.205875 -0.298803 0.030247
H  2.148267 1.537739 -0.133522
H  1.081765 1.142004 -1.509878
H  0.16594 1.802305 1.377256
H  -0.14241 2.765994 -0.086914
H  0.022913 -2.013334 0.396923
H  -2.291733 -2.035096 -0.463021
H  -3.230995 -0.625468 -0.030969
