program: Gaussian 09
title: 000242427
version: EM64L-G09RevD.01
frameworkgroup: C1[X(C13H15ClN4)]
method: RPBEPBE
basis: SDD
operation: Freq
keyword: #p
keyword: freq=noraman
keyword: PBEPBE/SDD
title: #p freq=noraman PBEPBE/SDD
converged: YES YES NO NO
title: Mulliken charges:
elementType: Cl N N N N C C C C C C C C C C C C C H H H H H H H H H H H H H H H
charge: -0.052565 -0.460703 -0.137896 -0.004995 -0.587191 0.363297 -0.518850 0.139303 0.447741 -0.672694 -0.335800 -0.469924 -0.322865 0.451696 -0.372256 -0.389057 -0.025622 -0.810291 0.248293 0.192607 0.319522 0.211817 0.223379 0.242190 0.214936 0.306151 0.229563 0.225549 0.224679 0.222610 0.234680 0.336150 0.326544
chargesum: 0.00000
title: Mulliken charges with hydrogens summed into heavy atoms:
elementType: Cl N N N N C C C C C C C C C C C C C
charge: -0.052565 -0.141181 -0.137896 -0.004995 0.075503 0.363297 -0.077950 0.139303 0.447741 0.004693 -0.335800 -0.254987 -0.016714 0.451696 -0.142693 -0.163507 -0.025622 -0.128322
polarizability: 3.07730734e+02 -1.86983396e+00 2.04242157e+02 1.34873328e+00 7.43379811e+00 8.60736847e+01
1716.lowfreq: -6.3049 -0.3484 0.0007 0.0007 0.0016 6.3098 29.1083 30.7280 37.5389
frequency: 28.9353 30.6917 37.5026 54.9342 69.1297 86.8688 127.6062 172.7992 185.5923 200.1229 209.7953 225.9302 234.9902 269.9134 324.2249 335.6795 355.2090 396.7084 409.9646 417.8707 452.7410 480.9844 509.9551 516.3059 518.1274 554.4604 582.4309 613.2360 630.2670 682.9004 698.7596 717.5729 726.1839 756.0059 772.6045 781.7354 811.8506 818.9540 853.0651 879.8496 941.8916 944.2511 979.2472 986.8424 990.1262 1008.4227 1046.7155 1048.4539 1063.7791 1075.5078 1123.5052 1163.0242 1191.3271 1223.8919 1241.3371 1257.3811 1282.4799 1311.0050 1313.3124 1333.6779 1360.2472 1391.2037 1397.5446 1409.5495 1420.9431 1453.5531 1471.1402 1472.9788 1474.0463 1481.6658 1487.9729 1500.5591 1513.1396 1540.9128 1581.1208 1602.0868 1614.8065 1629.0176 2960.8970 2971.8181 2981.3836 3052.1619 3054.1282 3077.6202 3081.7521 3090.5540 3099.9222 3121.9917 3134.0852 3200.3140 3547.6913 3564.6032 3723.0723
redmass: 1.6738 1.6981 4.2710 3.4189 3.6762 4.6013 4.1868 5.5398 3.4880 1.3761 4.3874 5.3068 4.1540 4.7024 3.1634 3.4258 3.1318 5.0029 3.1690 5.0300 1.2060 4.2173 2.2560 3.1209 1.2294 4.5170 1.8543 2.5873 6.5762 5.7281 9.8144 3.0487 5.0439 3.7159 7.1366 1.5481 4.6619 1.5072 1.2884 4.7400 1.3598 2.8382 2.2942 1.4711 1.3226 2.8966 1.5850 2.9450 1.9161 1.6078 1.3296 3.3651 1.1160 2.6415 1.4684 2.7146 3.0806 1.5495 1.6630 2.9745 4.3595 1.1954 1.2286 4.1311 3.2052 4.4770 1.0444 1.0636 1.1745 1.2856 1.3063 1.6726 2.3471 3.1089 6.2587 2.2811 1.9852 6.3807 1.0699 1.0388 1.0361 1.0948 1.0919 1.0983 1.0996 1.1003 1.0880 1.0909 1.0957 1.0937 1.0747 1.0443 1.1059
irintensity: 0.2845 0.3863 0.0667 1.1544 1.2527 0.1466 0.0382 0.8883 1.8176 1.0641 2.3712 6.9098 3.3894 5.1689 5.2321 1.8884 0.0514 6.2089 0.6475 1.1842 282.0680 6.6846 52.9396 2.5008 7.4862 5.5785 14.0846 28.4464 0.0183 11.3847 0.4365 0.5282 5.5969 3.1729 18.2101 4.1435 26.0293 55.0174 23.2893 56.4463 3.4475 8.6714 5.1395 4.8725 4.8894 2.2926 34.0891 34.2688 33.9340 16.8223 5.5747 27.1422 1.0131 1.2646 15.8864 53.4639 44.5942 10.2026 17.1788 22.1107 14.3492 13.7305 3.0012 20.5102 238.0464 113.4325 11.7363 18.4228 73.4182 65.0267 31.3231 94.9593 156.5556 940.6544 253.5881 96.2270 485.9688 35.1206 38.9424 54.6714 31.3814 24.8994 0.9671 54.2436 18.5978 22.6667 20.5606 24.9627 21.5260 9.9412 23.7606 119.5188 46.5658
temp: 298.150 k
press: 1.00000 atm
elementType: 17 7 7 7 7 6 6 6 6 6 6 6 6 6 6 6 6 6 1 1 1 1 1 1 1 1 1 1 1 1 1 1 1
symmnumber: 1
zpe: 685000.4 jmol-1
zpe.correction: 0.260903 hartree
zpe.thermalcorrener: 0.278600 hartree
zpe.thermalcorrenthalpy: 0.279544 hartree
zpe.thermalcorrgfe: 0.213417 hartree
zpe.sumelectzpe: -1182.177890 hartree
zpe.sumelectthermal: -1182.160194 hartree
zpe.sumelectthermalent: -1182.159249 hartree
zpe.sumelectthermalfe: -1182.225376 hartree
dipole: 3.3412 -0.5531 0.1069
dipole: 3.3884
quadrupole: -120.0726 -90.2655 -118.4956
quadrupole: 1.2203 -1.0516 2.8511
quadrupole: -10.4614 19.3458 -8.8844 1.2203 -1.0516 2.8511
hfenergy: -1182.4387933 hartree
pointgroup: C01 [X(C13H15Cl1N4)]
dipole: 1.3228497 0.1570332 -0.0502147 debye
polarizability: 307.6853123|-2.7922346|204.6487372|-1.4124062|3.5580087|85.7125262 unknown
InChI: InChI=1S/C13H15ClN4/c1-3-10-11(14)17-13(15)18-12(10)16-9-6-4-8(2)5-7-9/h4-7,16H,3,15H2,1-2H3
charge 0 multiplicity 1
33 atoms
Cl -5.040751 0.690463 0.241691
N  0.200186 0.809444 0.160012
N  -0.91047 -1.288184 0.023581
N  -3.344876 -1.395004 0.055506
N  -2.04811 -3.333484 -0.120987
C  -2.23602 0.788281 0.221854
C  -2.307913 2.300229 0.319666
C  -0.976522 0.072136 0.132718
C  1.566061 0.412965 0.114026
C  -2.155092 3.011806 -1.054341
C  -3.358086 -0.05787 0.166987
C  2.532439 1.456843 0.149986
C  2.015169 -0.93148 0.034119
C  4.374491 -0.17437 0.03479
C  3.908682 1.163919 0.10962
C  3.399316 -1.202277 -0.005437
C  -2.097805 -1.964343 -0.00981
C  5.859862 -0.491071 0.023396
H  -3.282385 2.581469 0.754141
H  -1.546091 2.678517 1.033743
H  0.065352 1.81909 0.229899
H  -1.207154 2.74726 -1.558775
H  -2.185338 4.10987 -0.931909
H  -2.980655 2.719425 -1.726044
H  2.203631 2.503713 0.205792
H  1.275167 -1.730736 -0.000081
H  4.632223 1.987753 0.135947
H  3.727743 -2.2473 -0.070082
H  6.071471 -1.419078 -0.536846
H  6.445096 0.324788 -0.436944
H  6.248019 -0.633622 1.051188
H  -2.919512 -3.855497 -0.149607
H  -1.147429 -3.799457 -0.176997
