program: Gaussian 09
title: 000242425
version: EM64L-G09RevD.01
frameworkgroup: C1[X(C12H15N3O2)]
method: RPBEPBE
basis: SDD
operation: Freq
keyword: #p
keyword: freq=noraman
keyword: PBEPBE/SDD
title: #p freq=noraman PBEPBE/SDD
converged: YES YES NO NO
title: Mulliken charges:
elementType: O O N N N C C C C C C C C C C C C H H H H H H H H H H H H H H H
charge: -0.227094 -0.251812 -0.469233 -0.345911 -0.387645 -0.144027 -0.423317 0.140484 0.486120 -0.662898 0.377433 0.188344 -0.383237 0.326932 -0.440231 -0.815616 -0.815118 0.270335 0.263167 0.249961 0.331557 0.342561 0.229217 0.362856 0.220475 0.224844 0.229118 0.224973 0.225688 0.222011 0.227333 0.222728
chargesum: 0.00000
title: Mulliken charges with hydrogens summed into heavy atoms:
elementType: O O N N N C C C C C C C C C C C C
charge: -0.227094 -0.251812 -0.137676 -0.003350 -0.024789 0.126308 0.089812 0.140484 0.486120 -0.433681 0.377433 0.188344 -0.162762 0.326932 -0.215387 -0.135837 -0.143046
polarizability: 2.38373209e+02 4.79069357e+00 1.53352968e+02 4.07673365e+00 5.14700462e+00 8.86169160e+01
1716.lowfreq: -8.1955 -0.0004 -0.0002 0.0003 4.9144 9.4917 31.9935 55.0532 57.8582
frequency: 31.8306 55.0416 57.8515 110.3938 113.5372 138.3066 151.2185 153.3927 203.5156 208.4583 231.4835 260.8158 290.5961 322.4615 369.2995 382.6515 404.3350 445.8334 469.5886 487.3806 504.5680 540.2120 556.6232 561.8131 582.1933 607.9193 650.4457 693.7801 713.4607 719.1114 737.6490 757.2445 773.6486 796.8431 808.6944 868.1984 924.1614 930.9002 936.4986 991.4194 1004.8657 1019.9147 1029.0991 1044.5410 1051.6474 1101.8618 1123.0456 1173.8753 1198.3622 1203.2361 1232.7630 1239.7786 1268.8514 1279.2882 1304.8320 1331.7442 1348.6988 1367.5163 1375.7606 1383.7455 1393.0088 1403.2349 1411.5300 1416.6584 1461.4496 1466.0617 1473.4560 1479.1577 1488.7296 1498.1913 1515.4779 1585.8318 1637.1703 1641.0801 1684.5156 2896.0511 2962.3318 2969.0094 2984.3668 3031.9148 3042.3650 3076.2359 3083.4233 3088.6566 3109.3838 3114.1915 3145.3524 3496.9484 3529.0938 3575.4031
redmass: 4.8133 5.4040 4.7173 1.3795 2.4736 1.8056 6.1583 1.6012 4.0043 3.9207 3.6537 3.1881 2.5476 3.6788 7.7467 3.5359 3.3491 2.8407 5.4074 5.6601 1.8047 3.0097 2.7359 1.3284 3.0578 3.7621 2.8451 3.5216 4.4606 3.0127 4.7531 2.1288 3.1025 1.7800 2.1518 1.5078 1.8840 1.8434 2.8440 1.6102 1.5349 2.7170 1.4397 2.5642 1.6257 2.3956 2.1813 1.7381 1.8427 1.7495 2.0021 2.4693 1.4144 1.4107 1.4310 2.4423 2.4052 1.8420 4.7382 2.0740 1.2475 1.3336 1.6144 2.2518 1.0470 1.1223 1.0472 1.2311 1.1022 1.8780 2.6721 5.3885 6.5858 7.4134 5.6402 1.0801 1.0379 1.0378 1.0682 1.0971 1.0969 1.0978 1.0982 1.0968 1.0909 1.0877 1.0947 1.0760 1.0770 1.0780
irintensity: 0.2642 0.1292 2.0700 1.0882 3.0211 1.9836 2.4088 0.2226 2.4165 4.5265 2.5143 9.5208 0.0500 0.6076 17.2726 9.8329 4.2976 5.1895 29.8739 7.7396 69.2401 6.7719 14.1449 102.5716 2.2946 17.6568 21.8476 3.8461 1.1863 4.8418 3.0447 123.6623 28.4432 45.8003 8.8499 26.9572 6.3678 4.1372 5.1704 2.1445 13.1026 13.1565 16.8213 4.7228 0.1741 37.9536 6.0679 24.1857 42.8624 4.0462 22.9813 164.5441 23.7687 4.6504 72.3353 34.9189 144.3913 0.7046 47.5796 66.0266 7.1178 8.8410 23.8878 15.0989 0.0171 22.9045 29.6628 0.0993 23.9107 5.7169 317.1427 43.8242 209.7763 211.9625 572.2157 48.3981 62.6066 35.8154 36.9947 33.5513 15.4628 29.5276 14.4319 11.7829 24.2324 21.4707 32.2901 95.9329 67.6374 46.5698
temp: 298.150 k
press: 1.00000 atm
elementType: 8 8 7 7 7 6 6 6 6 6 6 6 6 6 6 6 6 1 1 1 1 1 1 1 1 1 1 1 1 1 1 1
symmnumber: 1
zpe: 677607.2 jmol-1
zpe.correction: 0.258087 hartree
zpe.thermalcorrener: 0.274132 hartree
zpe.thermalcorrenthalpy: 0.275076 hartree
zpe.thermalcorrgfe: 0.214234 hartree
zpe.sumelectzpe: -779.774908 hartree
zpe.sumelectthermal: -779.758863 hartree
zpe.sumelectthermalent: -779.757919 hartree
zpe.sumelectthermalfe: -779.818762 hartree
dipole: 2.5342 -1.5919 1.4328
dipole: 3.3180
quadrupole: -113.6824 -98.6746 -101.9380
quadrupole: -0.6893 -3.6165 0.7464
quadrupole: -8.9174 6.0904 2.8270 -0.6893 -3.6165 0.7464
hfenergy: -780.0329955 hartree
pointgroup: C01 [X(C12H15N3O2)]
dipole: 0.9973183 -0.6712139 0.5088478 debye
polarizability: 238.3866767|4.4124073|152.0578192|4.2980734|10.4060174|89.8985973 unknown
InChI: InChI=1S/C12H15N3O2/c1-7-3-4-9(5-8(7)2)14-10-6-13-12(17)15-11(10)16/h3-5,10,13-15H,6H2,1-2H3
charge 0 multiplicity 1
32 atoms
O  -2.286167 2.469611 -0.287569
O  -5.360762 -1.045754 -0.215237
N  -0.169547 0.835197 0.309338
N  -3.154323 -1.466289 0.463232
N  -3.804557 0.707604 -0.179682
C  -1.395989 0.174005 -0.082365
C  -1.862777 -0.921359 0.919408
C  -2.511728 1.233103 -0.190757
C  1.107919 0.280497 0.108328
C  2.257031 1.057802 0.430255
C  3.565901 0.560804 0.263074
C  -4.182759 -0.66189 0.011998
C  1.306517 -1.03294 -0.3972
C  3.762801 -0.76429 -0.241576
C  2.61865 -1.528968 -0.562595
C  4.757528 1.432062 0.620709
C  5.157975 -1.333725 -0.428752
H  -1.308695 -0.304802 -1.086775
H  -1.120524 -1.734056 0.961953
H  -1.937232 -0.475599 1.931688
H  -0.24548 1.853303 0.399808
H  -3.39652 -2.443519 0.628066
H  2.116933 2.07367 0.822412
H  -4.581032 1.351242 -0.361689
H  0.458828 -1.666841 -0.678634
H  2.752562 -2.543804 -0.957435
H  4.438803 2.422285 0.988108
H  5.380009 0.962789 1.407013
H  5.418746 1.591011 -0.252863
H  5.721103 -1.36785 0.524548
H  5.116665 -2.361456 -0.829125
H  5.76122 -0.724842 -1.130483
