program: Gaussian 09
title: 000242424
version: EM64L-G09RevD.01
frameworkgroup: C1[X(C12H23NO2)]
method: RPBEPBE
basis: SDD
operation: Freq
keyword: #p
keyword: freq=noraman
keyword: PBEPBE/SDD
title: #p freq=noraman PBEPBE/SDD
converged: NO YES NO NO
title: Mulliken charges:
elementType: O O N C C C C C C C C C C C C H H H H H H H H H H H H H H H H H H H H H H H
charge: -0.269034 -0.253864 -0.313114 -0.045463 -0.412427 -0.440978 -0.392807 -0.388111 -0.384001 -0.111652 -0.487779 -0.722011 0.246489 -0.262368 -0.665164 0.201046 0.182940 0.213141 0.213183 0.181401 0.198465 0.191215 0.192099 0.197116 0.199229 0.187292 0.240857 0.239986 0.223097 0.230588 0.228084 0.237340 0.201035 0.220854 0.233216 0.215201 0.248929 0.225967
chargesum: 0.00000
title: Mulliken charges with hydrogens summed into heavy atoms:
elementType: O O N C C C C C C C C C C C C
charge: -0.269034 -0.253864 -0.072256 0.155582 -0.016346 -0.046394 -0.003127 0.001105 0.002520 0.128334 -0.034093 -0.055552 0.246489 0.191703 0.024933
polarizability: 1.94376613e+02 -2.64714521e+00 1.28662548e+02 -1.97179526e+00 -1.02691304e-02 1.21005552e+02
1716.lowfreq: -7.0071 -1.9876 -0.0004 0.0004 0.0008 14.9743 25.0538 29.0604 47.3867
frequency: 24.7724 27.4308 47.2680 52.7188 64.9895 91.8441 96.1929 158.6426 169.5466 211.0305 218.6741 226.3752 262.4035 288.6465 299.2694 319.9594 357.6127 392.9912 398.4398 424.9503 447.7402 467.8088 477.8331 521.0494 568.1294 604.1874 682.5760 766.8540 781.6588 787.2543 813.0261 836.7982 844.2948 881.2386 886.3536 889.2821 904.9248 916.0707 921.1816 981.7187 1016.0658 1040.8391 1047.4215 1052.9633 1066.4638 1081.3642 1095.0210 1109.8185 1113.8939 1126.7631 1152.7315 1155.4094 1184.1164 1187.8696 1232.3699 1242.0489 1252.7145 1255.7228 1267.5288 1278.8798 1295.8018 1300.7218 1321.8835 1323.8420 1333.2335 1334.1643 1338.1289 1343.6467 1355.3255 1369.6289 1389.6830 1390.2116 1440.2718 1450.9875 1455.8146 1458.9341 1460.3688 1463.4970 1464.8998 1469.7277 1472.9079 1475.9900 1477.7920 1484.6820 1624.3154 2951.8806 2961.6148 2964.6149 2965.7073 2966.8025 2974.3301 2978.7288 2992.1706 2998.1944 3012.3438 3024.8670 3025.4966 3026.7723 3030.6197 3038.1192 3049.4436 3073.3044 3087.2559 3089.2395 3090.4976 3098.8269 3116.6607 3463.6518
redmass: 3.8800 3.6126 3.3091 3.1966 3.5875 2.9835 3.7038 3.7914 2.9598 1.2006 1.2909 1.7029 2.1967 2.9248 2.2546 1.8046 3.1767 2.3748 1.9634 2.5561 3.1271 1.8766 3.4290 2.0959 1.8180 3.9580 4.3824 2.7649 1.4357 2.2536 1.3426 2.0220 2.8738 2.0211 1.5672 1.5516 3.1174 1.7998 1.6773 2.1968 2.8533 1.6390 1.3127 2.0204 1.3692 2.7861 2.1569 2.3815 2.1984 2.1895 2.7407 1.7351 2.1373 1.6611 1.3990 1.4720 1.2919 1.2886 1.4387 1.1224 1.2955 1.3079 1.3702 1.3135 1.3563 1.3540 1.4644 1.4064 1.2912 1.3557 1.2349 1.2436 1.1130 1.1988 1.0976 1.0872 1.0897 1.0428 1.0873 1.0770 1.0938 1.0536 1.0960 1.0509 9.0087 1.0680 1.0734 1.0629 1.0600 1.0649 1.0702 1.0393 1.0360 1.0828 1.0596 1.0960 1.0602 1.0957 1.0978 1.1018 1.1004 1.0971 1.0976 1.1036 1.1034 1.1001 1.1055 1.0744
irintensity: 1.1039 0.3908 0.2668 0.4898 1.1051 0.0764 0.4213 2.6242 0.6488 1.8479 2.0684 0.4033 4.3451 2.2195 9.3374 7.1564 9.0404 1.3827 10.3671 13.3895 2.5119 5.4219 11.0670 83.1054 18.8189 19.5368 12.5982 9.8924 0.6448 0.3036 2.8160 3.4293 10.5208 15.1698 15.1610 7.4043 30.9926 3.1408 6.4734 2.9297 69.8443 8.9107 3.4674 185.0139 0.8212 51.1192 26.1542 1.1379 10.5104 54.4119 253.1754 6.6033 16.5592 5.6089 13.7283 22.8133 2.1530 4.4809 102.9969 5.9700 23.2371 17.0806 2.1810 6.4402 14.0356 14.9813 0.4278 2.1931 6.7093 3.7065 18.8541 28.8351 3.6581 32.3656 14.5059 4.3154 5.5897 14.6726 10.9911 20.5278 16.1905 6.5678 3.8216 13.0367 161.6258 18.6332 14.2987 26.5887 30.8659 33.7135 53.5083 17.3564 23.2712 13.8497 12.9077 88.6170 43.1271 79.7954 3.1598 66.2792 81.1720 33.0572 37.4224 19.4315 1.3676 31.0474 35.4552 0.9612
temp: 298.150 k
press: 1.00000 atm
elementType: 8 8 7 6 6 6 6 6 6 6 6 6 6 6 6 1 1 1 1 1 1 1 1 1 1 1 1 1 1 1 1 1 1 1 1 1 1 1
symmnumber: 1
zpe: 881356.8 jmol-1
zpe.correction: 0.335691 hartree
zpe.thermalcorrener: 0.352952 hartree
zpe.thermalcorrenthalpy: 0.353896 hartree
zpe.thermalcorrgfe: 0.288835 hartree
zpe.sumelectzpe: -675.052565 hartree
zpe.sumelectthermal: -675.035304 hartree
zpe.sumelectthermalent: -675.034360 hartree
zpe.sumelectthermalfe: -675.099421 hartree
dipole: 0.0491 -0.4487 -1.9398
dipole: 1.9916
quadrupole: -82.0359 -94.0483 -97.1140
quadrupole: 1.3554 -2.6706 -0.5209
quadrupole: 9.0302 -2.9822 -6.0480 1.3554 -2.6706 -0.5209
hfenergy: -675.388256 hartree
pointgroup: C01 [X(C12H23N1O2)]
dipole: 0.0429212 0.3597369 0.6947714 debye
polarizability: 193.058882|1.4369606|125.4974813|-9.8961204|-3.986334|125.4883495 unknown
InChI: InChI=1S/C12H23NO2/c1-3-15-12(14)9-10(2)13-11-7-5-4-6-8-11/h10-11,13H,3-9H2,1-2H3
charge 0 multiplicity 1
38 atoms
O  -3.482156 0.179968 0.937354
O  -2.800268 -1.321685 -0.720638
N  0.930161 1.156933 -0.525124
C  1.977529 0.118405 -0.385776
C  3.215975 0.479244 -1.248665
C  2.416194 -0.123077 1.088384
C  4.333224 -0.586874 -1.145485
C  3.530082 -1.193514 1.197351
C  4.753086 -0.823605 0.32471
C  -0.471948 0.77957 -0.741186
C  -1.12144 0.015623 0.485421
C  -1.288503 2.03829 -1.096249
C  -2.512989 -0.474673 0.161625
C  -4.906897 -0.199462 0.68377
C  -5.30381 -1.408912 1.535388
H  1.553213 -0.829388 -0.781084
H  3.606017 1.460969 -0.906802
H  2.890574 0.613723 -2.296878
H  1.541551 -0.41015 1.703493
H  2.7959 0.83805 1.498662
H  5.208004 -0.278266 -1.750318
H  3.969334 -1.5425 -1.57803
H  3.128169 -2.173074 0.864016
H  3.834014 -1.317683 2.255133
H  5.519488 -1.620767 0.383187
H  5.218838 0.101146 0.724491
H  1.049185 1.950174 0.116567
H  -0.506092 0.078869 -1.598504
H  -1.14524 0.677335 1.368133
H  -0.494067 -0.866037 0.710022
H  -2.339332 1.786041 -1.32103
H  -0.846429 2.533401 -1.977447
H  -1.288509 2.758151 -0.25451
H  -5.470767 0.705673 0.961615
H  -5.028463 -0.412052 -0.393188
H  -6.381175 -1.6222 1.404657
H  -4.736301 -2.303902 1.229844
H  -5.117351 -1.214539 2.605792
