program: Gaussian 09
title: 000242409
version: EM64L-G09RevD.01
frameworkgroup: C1[X(C10H13ClO2S)]
method: RPBEPBE
basis: SDD
operation: Freq
keyword: #p
keyword: freq=noraman
keyword: PBEPBE/SDD
title: #p freq=noraman PBEPBE/SDD
converged: YES YES NO NO
title: Mulliken charges:
elementType: Cl S O O C C C C C C C C C C H H H H H H H H H H H H H
charge: -0.075086 0.896574 -0.559554 -0.547434 -0.571997 -0.304563 -0.074612 -0.250171 -0.250789 -0.578521 0.449449 -0.362322 -0.368153 -0.798510 0.287909 0.286587 0.261994 0.246089 0.286971 0.286327 0.267470 0.278127 0.243915 0.244746 0.230070 0.245181 0.230302
chargesum: 0.00000
title: Mulliken charges with hydrogens summed into heavy atoms:
elementType: Cl S O O C C C C C C C C C C
charge: -0.075086 0.896574 -0.559554 -0.547434 0.002500 0.203520 -0.074612 0.036800 0.035539 -0.032924 0.449449 -0.118406 -0.123407 -0.092958
polarizability: 1.72414623e+02 -2.51140441e+01 1.28793391e+02 -3.20693880e+00 -3.93601578e-01 1.38530661e+02
1716.lowfreq: -24.2631 -10.1135 -5.8710 -2.1559 -0.0015 0.0013 0.0015 16.7774 28.8830
frequency: -24.1961 16.5055 28.6840 47.7798 73.9008 94.2116 125.4770 140.2069 172.3224 220.8434 222.1813 259.3313 288.6992 314.8976 346.7870 381.6175 391.7939 408.3309 439.2172 509.7264 574.4179 596.9420 620.1693 622.8198 709.1924 773.8166 778.3888 794.9719 831.0971 854.7889 859.1242 914.7754 964.5317 966.1568 983.3302 991.7601 995.2315 1013.4674 1049.8114 1052.8316 1074.3805 1113.1084 1117.1638 1176.5579 1182.8016 1217.6988 1233.0194 1256.0739 1294.0536 1306.0390 1356.0840 1380.4086 1390.0354 1400.4116 1420.6217 1450.2544 1459.8180 1470.8203 1473.2817 1474.2787 1594.7363 1595.8217 2974.2376 2981.2833 3043.4088 3051.7258 3061.2943 3064.0291 3092.7691 3133.4477 3135.3311 3138.3997 3141.8209 3155.7470 3159.1596
redmass: 1.0150 8.2453 3.4179 3.7953 5.6503 4.2479 6.8229 4.9215 4.3848 4.2202 3.9385 3.7205 5.2374 3.7681 4.2921 4.0404 7.6837 2.8872 4.7908 3.0908 5.1934 5.1725 4.1530 5.7061 3.3394 5.7385 2.3075 2.1929 1.3598 1.2526 1.5851 8.7450 1.5204 1.8260 1.3907 1.4606 4.3033 1.6352 1.6036 2.4350 1.4961 1.6040 1.3069 1.2871 1.1613 2.9206 1.2311 1.2015 1.2702 1.1383 1.3836 5.8829 3.0546 1.2202 1.1175 1.0962 1.0904 1.0974 2.3783 1.0586 6.8031 6.1221 1.0637 1.0389 1.0602 1.0731 1.0774 1.0950 1.1001 1.0886 1.0887 1.1101 1.1103 1.0956 1.0972
irintensity: 0.6040 1.8149 3.5890 1.1051 5.5534 3.0972 1.6002 1.6364 0.5549 8.8729 3.3919 1.9605 15.2550 2.9280 12.3899 5.4079 31.2253 0.0904 25.6933 48.2717 5.1622 41.4114 20.2574 7.9866 1.2936 25.1383 3.2429 85.2553 33.3692 1.1989 2.7865 75.7894 3.6518 16.7156 0.2657 1.5731 2.3882 6.3876 25.3987 24.3773 8.7783 3.3138 9.3024 16.5429 5.3392 7.2278 7.6222 12.2501 2.5504 16.9720 11.8501 0.0446 10.0734 16.0696 6.8257 8.6401 19.2371 17.0564 19.1644 13.8255 1.3815 9.2649 9.8250 23.0696 0.9863 8.7698 27.4095 17.9276 14.6656 11.8043 6.7380 4.8802 8.5996 1.9658 11.6869
temp: 298.150 k
press: 1.00000 atm
elementType: 17 16 8 8 6 6 6 6 6 6 6 6 6 6 1 1 1 1 1 1 1 1 1 1 1 1 1
symmnumber: 1
zpe: 544302.4 jmol-1
zpe.correction: 0.207314 hartree
zpe.thermalcorrener: 0.222211 hartree
zpe.thermalcorrenthalpy: 0.223155 hartree
zpe.thermalcorrgfe: 0.162389 hartree
zpe.sumelectzpe: -1396.213616 hartree
zpe.sumelectthermal: -1396.198719 hartree
zpe.sumelectthermalent: -1396.197774 hartree
zpe.sumelectthermalfe: -1396.258541 hartree
dipole: 1.8746 -4.9282 1.2384
dipole: 5.4162
quadrupole: -81.0646 -119.7383 -96.4770
quadrupole: -11.1152 -5.5105 -2.7742
quadrupole: 18.0287 -20.6450 2.6163 -11.1152 -5.5105 -2.7742
hfenergy: -1396.4209298 hartree
pointgroup: C01 [X(C10H13Cl1O2S1)]
dipole: -0.8640842 -1.8994283 -0.4315138 debye
polarizability: 177.3932926|19.7031129|124.7462586|0.4487154|4.8598784|137.5991236 unknown
InChI: InChI=1S/C10H13ClO2S/c1-9-3-5-10(6-4-9)14(12,13)8-2-7-11/h3-6H,2,7-8H2,1H3
charge 0 multiplicity 1
27 atoms
Cl 3.740214 -2.364781 1.690327
S  0.895939 1.706515 0.356723
O  1.368758 2.135185 -1.156656
O  0.665505 2.802898 1.550794
C  2.236682 0.456078 1.013731
C  2.706782 -0.449216 -0.123429
C  -0.696827 0.701042 0.18059
C  -1.000768 0.144992 -1.072182
C  -1.544092 0.602913 1.295646
C  3.99656 -1.19656 0.21616
C  -3.093906 -0.7233 -0.093957
C  -2.209412 -0.575429 -1.196094
C  -2.746681 -0.123468 1.146265
C  -4.404339 -1.472588 -0.251679
H  3.016637 1.140551 1.388637
H  1.744011 -0.067307 1.846986
H  2.90516 0.179687 -1.017335
H  1.918049 -1.173349 -0.396724
H  -0.328298 0.300287 -1.922705
H  -1.28419 1.101277 2.235762
H  4.812142 -0.523781 0.521965
H  4.321085 -1.84705 -0.609152
H  -2.472431 -1.021848 -2.162138
H  -3.426211 -0.219074 2.000928
H  -4.754264 -1.886942 0.709387
H  -5.197891 -0.798698 -0.628472
H  -4.312314 -2.304232 -0.971778
