program: Gaussian 09
title: 000242401
version: EM64L-G09RevD.01
frameworkgroup: C1[X(C19H14BrNO)]
method: RPBEPBE
basis: SDD
operation: Freq
keyword: #p
keyword: freq=noraman
keyword: PBEPBE/SDD
title: #p freq=noraman PBEPBE/SDD
converged: YES YES NO NO
title: Mulliken charges:
elementType: Br O N C C C C C C C C C C C C C C C C C C C H H H H H H H H H H H H H H
charge: -0.000287 -0.266780 -0.477517 0.162958 0.313382 0.267597 -0.307477 -0.343414 -0.391762 -0.424552 -0.249259 -0.190430 0.129012 0.236499 -0.225700 -0.224572 -0.239127 -0.337907 -0.339738 -0.225212 -0.243197 -0.227784 0.268576 0.317029 0.336918 0.254787 0.278243 0.251108 0.232651 0.234921 0.235870 0.276564 0.218143 0.234291 0.231922 0.234245
chargesum: 0.00000
title: Mulliken charges with hydrogens summed into heavy atoms:
elementType: Br O N C C C C C C C C C C C C C C C C C C C
charge: -0.000287 -0.266780 -0.140599 0.162958 0.313382 0.267597 -0.038901 -0.026385 -0.136976 -0.146309 -0.249259 0.060678 0.129012 0.236499 0.006952 0.010349 -0.003258 -0.061343 -0.121595 0.009079 -0.011275 0.006461
polarizability: 3.63907198e+02 -1.40076252e+01 2.59546789e+02 -1.66993775e+01 -1.84216190e+01 1.16027350e+02
1716.lowfreq: -5.1108 -4.3080 -0.0006 -0.0006 -0.0002 4.5951 23.4012 31.3047 38.2974
frequency: 23.3541 31.2708 38.2662 52.8861 64.8957 75.7224 93.1066 125.8257 139.5000 186.9647 187.9664 228.1382 261.9886 287.4289 302.9991 346.9844 359.5696 400.3493 405.1501 409.3886 429.4116 482.2542 495.7834 537.5696 572.5001 613.5901 614.3506 617.0338 618.7918 674.6228 680.2407 688.1076 703.8326 714.9552 739.8289 748.3163 773.6593 791.6586 826.6368 845.1352 852.3215 862.9026 869.4977 884.8974 930.8861 935.9513 982.8584 984.8445 985.9397 986.9318 988.9156 999.2315 1000.9074 1007.6618 1024.3275 1035.7537 1072.3200 1081.0238 1085.5982 1093.0459 1133.8151 1174.1499 1174.7902 1192.3020 1195.3656 1230.6800 1245.3685 1270.4289 1294.2942 1313.6244 1323.0621 1359.3539 1367.9595 1384.9732 1389.5798 1429.2841 1434.2656 1454.2271 1477.6015 1487.5296 1503.2881 1566.3990 1576.0208 1582.0222 1600.5820 1608.6253 1610.7536 1610.8708 3116.1476 3124.1797 3129.1358 3133.0374 3141.0931 3146.2056 3151.2406 3159.6862 3163.2551 3164.9289 3167.3914 3170.9274 3191.2461 3497.6610
redmass: 5.6685 4.6501 4.8255 4.6039 7.4033 7.1853 4.4400 6.5784 6.3204 8.0620 6.4927 5.0340 4.9976 6.6811 7.4606 6.7469 5.1117 2.8295 3.0322 4.2899 4.3276 4.9539 3.6898 3.9921 4.1225 6.6614 6.4475 6.9072 6.5009 5.6299 2.3412 1.9356 1.5346 2.0448 2.6163 5.5482 1.9957 2.4666 5.4895 1.3876 1.3050 1.2504 5.7311 1.3887 1.3861 1.4386 1.5192 1.3267 1.5032 3.7319 5.1932 2.3515 2.0514 1.3445 2.5571 2.0715 2.5601 1.7115 1.7253 2.0645 1.5588 1.0599 1.0535 1.1178 1.1207 1.9289 3.1468 1.4888 2.4585 1.4481 1.3832 6.3524 5.3077 8.1190 4.2380 2.3557 2.2758 2.3885 2.2228 2.4749 2.6237 6.5536 5.0709 5.7959 6.8069 5.9338 4.4083 6.2135 1.0880 1.0865 1.0871 1.0869 1.0919 1.0919 1.0963 1.0957 1.0923 1.0912 1.1016 1.1005 1.0955 1.0758
irintensity: 0.5485 0.0843 0.2561 0.1059 3.2651 0.3427 0.8135 1.2270 1.7478 0.4594 0.1235 2.7111 0.1621 0.2144 19.7776 0.6293 1.1935 0.4942 0.5420 3.3239 2.6194 1.2502 14.3863 13.9983 18.5201 1.0972 0.5755 7.2271 3.5124 15.3185 6.3582 16.7314 160.1300 17.0801 12.2045 16.0883 34.0413 17.8690 35.5259 47.3704 2.2404 2.2323 15.5957 8.6760 3.5654 2.1840 2.0760 4.0086 2.4605 2.4730 0.6134 13.9915 6.2002 1.6260 10.9308 16.6078 19.6595 18.3217 1.6179 9.2238 1.3449 2.5269 0.0531 1.3226 11.1152 10.5455 92.1361 23.3787 73.9459 5.5945 9.0517 70.2913 26.4004 2.7413 115.8160 15.2113 0.8471 67.1727 138.2661 5.6624 562.7783 88.7080 20.7307 13.3085 17.4388 21.4086 30.1539 3.9772 14.4038 3.6399 0.6140 1.2686 9.7350 21.1373 26.2768 13.4536 1.9479 2.1517 21.8424 24.3322 12.8294 62.3047
temp: 298.150 k
press: 1.00000 atm
elementType: 35 8 7 6 6 6 6 6 6 6 6 6 6 6 6 6 6 6 6 6 6 6 1 1 1 1 1 1 1 1 1 1 1 1 1 1
symmnumber: 1
zpe: 719573.0 jmol-1
zpe.correction: 0.274071 hartree
zpe.thermalcorrener: 0.292547 hartree
zpe.thermalcorrenthalpy: 0.293491 hartree
zpe.thermalcorrgfe: 0.224228 hartree
zpe.sumelectzpe: -874.380181 hartree
zpe.sumelectthermal: -874.361704 hartree
zpe.sumelectthermalent: -874.360760 hartree
zpe.sumelectthermalfe: -874.430024 hartree
dipole: -3.6996 4.4176 -0.2199
dipole: 5.7663
quadrupole: -126.7279 -129.3656 -138.5231
quadrupole: -4.8090 -3.3322 -3.8879
quadrupole: 4.8110 2.1732 -6.9842 -4.8090 -3.3322 -3.8879
hfenergy: -874.6542517 hartree
pointgroup: C01 [X(C19H14Br1N1O1)]
dipole: 1.0510288 2.009453 0.064047 debye
polarizability: 348.6757334|36.7386702|269.460288|-37.1721306|16.0142777|121.3453158 unknown
InChI: InChI=1S/C19H14BrNO/c20-16-11-12-18(17(13-16)14-7-3-1-4-8-14)21-19(22)15-9-5-2-6-10-15/h1-13,21H
charge 0 multiplicity 1
36 atoms
Br -5.622038 -2.270446 0.434365
O  1.452922 -2.771815 -0.322709
N  0.362825 -0.70877 -0.044933
C  -1.994508 -0.068126 0.093052
C  -1.000856 -1.100524 0.006987
C  -1.647064 1.388155 0.057008
C  -3.354714 -0.43988 0.231147
C  -1.396162 -2.465269 0.022266
C  -2.117598 2.260986 1.07626
C  -0.883303 1.942939 -1.009622
C  -3.722934 -1.797233 0.2556
C  -2.756542 -2.815156 0.143209
C  1.499538 -1.511089 -0.167561
C  2.814864 -0.7720 -0.130775
C  -1.826011 3.64196 1.037861
C  -0.590256 3.324735 -1.046085
C  -1.057325 4.179366 -0.020957
C  3.949087 -1.459556 -0.635582
C  2.978567 0.538425 0.394609
C  5.217269 -0.844916 -0.638133
C  4.250414 1.151829 0.39457
C  5.371572 0.465611 -0.126659
H  -4.116885 0.342484 0.287706
H  -0.628849 -3.237186 -0.056716
H  0.517758 0.30212 -0.006287
H  -2.700071 1.847136 1.907354
H  -0.558556 1.29917 -1.835857
H  -3.049509 -3.86878 0.153014
H  -2.195161 4.296873 1.83482
H  -0.010567 3.733033 -1.88126
H  -0.831486 5.250842 -0.050366
H  3.806331 -2.477093 -1.013356
H  2.138029 1.083982 0.841594
H  6.083971 -1.384335 -1.035102
H  4.36768 2.158572 0.809995
H  6.357069 0.944257 -0.125253
