program: Gaussian 09
title: 000242397
version: EM64L-G09RevD.01
frameworkgroup: C1[X(C10H12N2O2)]
method: RPBEPBE
basis: SDD
operation: Freq
keyword: #p
keyword: freq=noraman
keyword: PBEPBE/SDD
title: #p freq=noraman PBEPBE/SDD
converged: YES YES NO NO
title: Mulliken charges:
elementType: O O N N C C C C C C C C C C H H H H H H H H H H H H
charge: -0.237513 -0.269266 -0.094893 -0.401998 0.301684 0.163633 -0.352170 -0.366716 -0.600700 0.261531 -0.219185 -0.231614 -0.223832 -0.751052 0.316954 0.274785 0.226198 0.276837 0.216357 0.257853 0.236296 0.233120 0.236246 0.266460 0.259503 0.221482
chargesum: 0.00000
title: Mulliken charges with hydrogens summed into heavy atoms:
elementType: O O N N C C C C C C C C C C
charge: -0.237513 -0.269266 -0.094893 -0.085044 0.301684 0.163633 -0.077385 -0.140518 0.150347 0.261531 0.017111 0.001506 0.012415 -0.003607
polarizability: 1.85423354e+02 2.51485442e+00 1.10934436e+02 2.80088342e+00 1.35465670e+01 8.71061040e+01
1716.lowfreq: -11.8059 -5.8778 0.0006 0.0009 0.0011 2.5386 28.5828 44.8443 66.5126
frequency: 28.3240 44.8179 66.5121 69.2760 124.8924 146.8489 149.5483 158.3355 192.2812 259.9706 315.8187 342.5036 383.2655 402.3347 407.1814 472.0212 493.5401 526.1326 567.3193 584.9339 614.2475 662.5343 691.0557 705.3289 748.8803 793.8803 857.1141 866.2372 937.0755 947.7428 985.7495 989.3908 995.4945 1007.0963 1026.4054 1034.8330 1075.5681 1093.0187 1123.4975 1153.5510 1175.5821 1190.8331 1237.0857 1267.2502 1318.3155 1353.8093 1377.1136 1384.5504 1409.5841 1431.3023 1446.6891 1453.7162 1465.5151 1473.8136 1482.8895 1488.5939 1579.9239 1610.3286 1611.5452 1623.0966 2986.7121 2999.3960 3075.3506 3088.9264 3123.2404 3123.6847 3134.8758 3135.4866 3147.8788 3159.6575 3171.6600 3502.8048
redmass: 3.8760 5.2261 4.9574 6.7757 3.8388 2.1987 1.0814 1.2578 4.3840 3.6598 5.3733 5.4410 3.8281 2.8466 4.2890 4.0783 2.0561 1.8473 2.8096 5.3161 6.3060 5.7004 4.7962 1.5293 4.3769 2.3657 1.3431 4.8343 1.4704 2.3632 1.4735 4.3686 2.2482 1.3483 2.2251 1.6643 2.0576 2.0722 1.3027 2.0949 1.0577 1.1197 4.9945 3.3352 1.3352 3.8543 1.2586 8.8892 1.2117 2.0340 1.1484 1.4433 1.0537 1.1256 1.7761 1.2180 6.2854 6.1555 7.6828 7.3819 1.0336 1.0372 1.1034 1.0976 1.0871 1.0989 1.0999 1.0875 1.0919 1.0959 1.1011 1.0781
irintensity: 0.0883 0.1646 6.4795 1.3458 5.5850 4.3481 0.2759 1.6809 4.1677 2.8763 11.4148 2.2367 7.2940 0.4456 0.6904 2.0784 23.8402 95.6946 14.2242 16.7953 0.8250 7.9474 2.7061 94.2797 1.6962 22.2308 0.7659 9.9034 2.7488 0.7083 3.1222 4.7074 68.0133 1.9993 3.8202 5.3317 20.4084 5.8128 3.0367 91.5007 0.3972 3.9334 30.1745 169.7178 0.5006 83.6495 44.1045 1.1984 69.1668 4.5287 97.1810 39.8937 22.6893 35.1174 27.8239 20.9625 35.2576 7.8398 68.6077 274.3252 43.5852 6.0903 23.7923 11.5802 9.4735 0.5316 14.9087 1.5322 18.6261 14.9118 19.1589 19.3979
temp: 298.150 k
press: 1.00000 atm
elementType: 8 8 7 7 6 6 6 6 6 6 6 6 6 6 1 1 1 1 1 1 1 1 1 1 1 1
symmnumber: 1
zpe: 538772.8 jmol-1
zpe.correction: 0.205208 hartree
zpe.thermalcorrener: 0.219122 hartree
zpe.thermalcorrenthalpy: 0.220066 hartree
zpe.thermalcorrgfe: 0.163139 hartree
zpe.sumelectzpe: -647.178428 hartree
zpe.sumelectthermal: -647.164515 hartree
zpe.sumelectthermalent: -647.163570 hartree
zpe.sumelectthermalfe: -647.220498 hartree
dipole: 5.3366 1.9510 3.3551
dipole: 6.5986
quadrupole: -91.7467 -76.9753 -82.2332
quadrupole: 0.3007 -4.5782 -0.7884
quadrupole: -8.0950 6.6764 1.4186 0.3007 -4.5782 -0.7884
hfenergy: -647.3836362 hartree
pointgroup: C01 [X(C10H12N2O2)]
dipole: -2.08629 -0.8738108 1.2741976 debye
dipolederiv: -0.7147434 -0.1647813 0.102575 -0.0411813 -0.5803382 0.2687749 -0.1036374 0.2389259 -0.60913 -1.3210095 0.0650053 0.1870583 -0.1552845 -0.4666676 -0.0737247 0.1552193 -0.1381094 -0.4639085 -0.3759376 0.1468435 0.2261068 0.3541895 -0.3785578 -0.1340465 0.3987834 -0.1846518 -0.5697231 -0.4912766 0.1251717 -0.2938307 0.4268472 -0.5092728 -0.0706797 -0.4077978 -0.0717837 -0.3821216 -0.4332688 -0.0678959 0.0171874 -0.0938202 -0.0300227 0.0227484 0.0329502 0.0304633 -0.0396477 1.6143636 0.0646529 0.1623467 -0.1680338 0.6080684 -0.4734945 0.5237057 -0.4268552 0.7559592 -0.0407614 0.0894022 -0.0431504 -0.0498718 0.0088582 -0.0508516 0.0734001 -0.0680368 -0.0793279 0.0355112 -0.0653471 0.0181041 0.0133677 -0.0210384 -0.0403589 -0.1060091 -0.0487432 -0.1323043 -0.1479749 0.1016515 0.092965 0.0500589 0.2696626 0.0745947 0.1091763 0.0521866 0.3128947 1.5898754 -0.160661 -0.4268482 -0.2852263 0.6575037 0.4521397 -0.7001074 0.5293456 0.7185593 0.016899 -0.1468331 0.075182 -0.1325384 -0.015511 -0.0627908 0.0686257 -0.0671888 -0.1138413 -0.1753999 0.0529984 -0.0258788 0.1088847 0.0784876 -0.0962967 -0.0503723 -0.097566 -0.1019903 0.1147448 0.0387219 -0.0134853 -0.0039981 -0.0378634 -0.0507223 0.0065318 -0.0455171 -0.1193926 -0.0615817 -0.1419475 -0.1342334 -0.0457552 -0.1748707 -0.1806293 -0.0665615 -0.1960412 -0.1235155 0.0660887 -0.0304001 0.0299922 -0.072979 0.2505709 0.0941637 0.0685311 0.0996569 0.1751232 0.1253064 -0.0522496 0.0222449 -0.0302489 0.0267519 0.053892 -0.0079109 0.0637682 0.1249097 -0.0152679 0.1045996 -0.0470078 0.1158216 0.0269219 0.0480767 -0.0417494 0.0521668 0.1164994 -0.0244413 -0.0649615 -0.0391223 -0.0179401 0.1464616 -0.0068308 0.0197651 0.0259717 0.1414091 0.1267998 -0.0130381 0.077959 -0.0082179 0.031552 0.0273782 0.025533 -0.0387927 -0.1708829 0.1010841 0.1123206 -0.0384671 0.0831815 -0.0684693 -0.0214349 -0.0268873 0.0499412 0.0322429 -0.0272395 0.0811873 -0.0423401 0.0947601 0.0185726 0.0670773 -0.0502889 0.0655397 0.125833 0.0541333 -0.0442985 0.0201646 -0.0668231 -0.0550099 0.0944743 0.0336337 0.0917855 0.1179255 -0.1120459 -0.0440023 0.0156258 -0.0467037 0.0959774 0.0271843 0.0141451 0.0290959 0.1463233 0.0603757 0.0250703 -0.0878082 0.0385134 0.0447121 0.0674036 -0.1021245 0.024822 0.044123 -0.0289131 0.0928848 0.0823634 0.04215 0.0575694 -0.0582026 0.0562681 -0.0580009 0.0841774 0.0646795 -0.104094 0.0622973 -0.1091522 0.0159512 0.0221554 0.0771778 0.0876173 0.009806 unknown
polarizability: 185.3073382|4.0632246|112.3861711|-2.2126528|-12.2936837|85.7703846 unknown
InChI: InChI=1S/C10H12N2O2/c1-8(13)12(2)11-10(14)9-6-4-3-5-7-9/h3-7,11H,1-2H3
charge 0 multiplicity 1
26 atoms
O  0.458481 1.336239 -1.063475
O  4.397127 -0.166727 -0.293374
N  2.315547 0.158841 0.674349
N  0.942807 -0.132718 0.681081
C  -1.390632 0.114293 -0.044342
C  0.054981 0.500756 -0.203626
C  -2.366097 1.032264 -0.511321
C  -1.808196 -1.123103 0.514848
C  2.749681 1.365548 1.40709
C  3.180061 -0.498817 -0.226184
C  -3.738607 0.731573 -0.396397
C  -3.183504 -1.424163 0.624253
C  -4.151136 -0.495287 0.176359
C  2.565055 -1.600584 -1.078359
H  0.590109 -0.668266 1.478642
H  -2.023664 1.967605 -0.965942
H  -1.073214 -1.875299 0.825862
H  3.835206 1.464225 1.253993
H  2.534913 1.262387 2.486081
H  2.237774 2.258565 1.006754
H  -4.485924 1.447644 -0.754624
H  -3.499583 -2.384284 1.046193
H  -5.217609 -0.730555 0.262373
H  1.891802 -1.162814 -1.837356
H  3.383498 -2.127783 -1.589831
H  1.978725 -2.317138 -0.478148
