program: Gaussian 09
title: 000242392
version: EM64L-G09RevD.01
frameworkgroup: C1[X(C12H17Cl2N5O)]
method: RPBEPBE
basis: SDD
operation: Freq
keyword: #p
keyword: freq=noraman
keyword: PBEPBE/SDD
title: #p freq=noraman PBEPBE/SDD
converged: YES YES NO NO
title: Mulliken charges:
elementType: Cl Cl O N N N N N C C C C C C C C C C C C H H H H H H H H H H H H H H H H H
charge: -0.055299 -0.067017 -0.201640 -0.145653 -0.160251 -0.363827 -0.025226 -0.001566 -0.364341 -0.424889 -0.386847 -0.304837 -0.332900 0.317430 -0.240139 -0.122951 -0.576665 -0.589966 0.031788 -0.241828 0.218958 0.226003 0.222397 0.248542 0.231125 0.234735 0.232402 0.240370 0.237606 0.247947 0.266608 0.261788 0.266284 0.287141 0.267193 0.324789 0.242734
chargesum: 0.00000
title: Mulliken charges with hydrogens summed into heavy atoms:
elementType: Cl Cl O N N N N N C C C C C C C C C C C C
charge: -0.055299 -0.067017 -0.201640 -0.145653 -0.160251 -0.039038 -0.025226 -0.001566 0.080620 0.046051 0.079014 0.167936 0.152653 0.317430 0.026469 -0.122951 -0.048593 -0.035632 0.031788 0.000907
polarizability: 2.62714673e+02 1.40924614e+01 1.89433581e+02 1.68405066e+00 -5.05680012e-02 1.11399208e+02
1716.lowfreq: -10.9015 -8.5071 -0.0010 -0.0005 0.0015 2.5013 15.4774 18.4808 34.5298
frequency: 14.9064 18.3855 34.3163 36.9100 48.1149 55.4200 71.3615 81.3512 91.8480 111.4486 141.2165 179.5191 201.5786 222.8462 223.8018 246.2361 253.8183 271.5873 336.7206 351.5203 363.1184 395.8871 428.5460 480.2739 494.7685 502.5058 552.9663 590.5335 602.6170 638.8203 641.1241 660.9530 672.0205 673.6533 731.9293 747.7437 760.3263 770.0694 782.1470 789.4088 825.0382 859.1911 872.8794 893.4132 931.9020 949.7834 1000.5157 1011.6742 1022.9147 1034.7439 1048.5899 1058.6953 1074.8422 1089.8918 1105.5084 1110.0301 1136.7767 1183.1512 1188.4012 1223.3588 1238.8657 1247.9725 1255.1753 1262.1086 1271.0678 1280.1696 1305.8199 1307.9613 1318.7422 1329.8473 1346.4044 1352.9457 1359.8947 1362.6941 1371.0651 1381.4935 1423.0545 1451.2960 1454.3150 1467.0953 1473.5149 1479.5903 1481.0562 1491.9686 1505.8481 1531.5691 1595.9826 1633.7928 2890.0785 2946.8069 2958.2813 2997.3821 3015.3717 3018.6065 3044.2208 3047.5141 3058.4204 3059.4609 3071.6493 3078.0334 3126.1863 3144.2469 3148.1397 3227.5420 3462.6548
redmass: 7.6319 7.3044 5.8963 5.4133 7.8322 14.0528 2.5264 3.0017 3.4246 6.2617 4.6066 6.2536 3.5030 4.0955 3.8892 2.3118 3.4175 4.2581 5.9611 3.4657 4.2838 4.6961 2.7293 8.1538 3.6502 4.7343 4.1672 4.0192 1.5097 4.5944 2.6551 10.5038 5.8089 6.7208 1.9901 2.2361 2.1367 1.1400 1.4326 3.6189 2.2191 7.1797 1.7867 1.4564 7.2518 2.2074 1.4285 1.7901 2.9367 3.6235 2.7304 3.3272 2.4642 2.7937 1.9390 2.2001 1.3647 2.0571 1.7915 1.5905 1.2490 1.2847 1.5331 1.4141 1.7101 1.2149 1.5168 1.2275 1.4135 2.8120 2.8317 1.3721 1.3606 1.6172 1.3821 1.3449 3.4075 1.0920 1.0891 1.0972 1.0840 1.0821 1.1256 1.0951 3.7208 6.9010 6.1223 12.3021 1.0706 1.0703 1.0652 1.0638 1.0681 1.0795 1.0983 1.0996 1.0577 1.0584 1.0884 1.1034 1.0926 1.1122 1.1118 1.0983 1.0806
irintensity: 2.4442 3.8672 2.9824 4.9378 4.4996 2.6592 0.8294 2.1385 1.6086 1.4852 3.4656 0.0164 4.9833 3.3713 0.9618 1.9217 0.6668 1.3746 1.0534 5.2924 7.8052 8.3423 0.3882 2.5144 4.5436 1.4796 4.4056 19.7684 72.3070 53.2689 0.5911 9.3459 93.4383 20.8457 6.5173 0.8327 24.7543 10.2051 23.0160 1.1594 12.2446 10.3498 2.4792 10.4715 55.3524 9.3581 4.2421 6.6554 13.6169 1.6396 15.3905 0.6960 1.6868 24.9323 30.0237 99.3578 3.5435 29.1462 7.4570 17.4436 20.6667 0.2966 26.0884 0.4304 3.7818 11.9162 3.0697 4.3579 17.0280 38.6948 27.4984 6.6103 0.8748 15.4515 11.4868 2.9868 11.9874 6.5016 1.3959 5.4717 17.3576 8.3427 9.8519 27.1151 13.8736 321.0944 86.0580 416.8046 84.5978 37.4861 50.8156 6.0723 10.7208 40.3978 7.0775 17.6640 12.1049 19.7175 19.6829 28.5912 17.1091 16.4996 15.5856 0.1040 229.3522
temp: 298.150 k
press: 1.00000 atm
elementType: 17 17 8 7 7 7 7 7 6 6 6 6 6 6 6 6 6 6 6 6 1 1 1 1 1 1 1 1 1 1 1 1 1 1 1 1 1
symmnumber: 1
zpe: 760642.7 jmol-1
zpe.correction: 0.289714 hartree
zpe.thermalcorrener: 0.310091 hartree
zpe.thermalcorrenthalpy: 0.311035 hartree
zpe.thermalcorrgfe: 0.235793 hartree
zpe.sumelectzpe: -1735.031212 hartree
zpe.sumelectthermal: -1735.010834 hartree
zpe.sumelectthermalent: -1735.009890 hartree
zpe.sumelectthermalfe: -1735.085133 hartree
dipole: -12.7996 0.3587 2.0747
dipole: 12.9716
quadrupole: -228.9339 -133.7153 -129.9961
quadrupole: 5.3836 -2.1640 -1.9634
quadrupole: -64.7188 30.4998 34.2190 5.3836 -2.1640 -1.9634
hfenergy: -1735.3209256 hartree
pointgroup: C01 [X(C12H17Cl2N5O1)]
dipole: -5.0615073 -0.2593472 0.5989762 debye
polarizability: 259.18065|20.8726079|192.185969|7.1278025|-4.959663|112.1808434 unknown
InChI: InChI=1S/C12H17Cl2N5O/c13-2-6-18(7-3-14)4-1-5-19-9-17-10-11(19)15-8-16-12(10)20/h8-9,15H,1-7H2
charge 0 multiplicity 1
37 atoms
Cl -6.633253 -1.391148 -1.21089
Cl -1.262091 3.454372 -0.52338
O  5.580327 0.174049 -0.080149
N  -3.090269 -0.080537 0.511741
N  1.098126 -1.212892 -0.1756
N  1.561167 1.263882 -0.2417
N  3.278991 -1.922205 -0.089735
N  3.913604 1.844062 -0.194294
C  -2.459178 -1.10209 1.390294
C  -0.916785 -1.140603 1.319414
C  -0.371982 -1.285967 -0.121539
C  -4.543625 -0.282797 0.301519
C  -2.656627 1.317043 0.701874
C  1.90313 -0.077973 -0.183279
C  1.998024 -2.304947 -0.112229
C  3.245654 -0.514541 -0.132292
C  -4.781189 -1.069207 -0.997188
C  -2.492911 2.005417 -0.667215
C  4.356081 0.451992 -0.131028
C  2.642903 2.166789 -0.245673
H  -2.857674 -2.086044 1.076722
H  -2.758224 -0.965127 2.457601
H  -0.478399 -0.238502 1.787236
H  -0.567723 -1.992925 1.932293
H  -0.678296 -2.25747 -0.549328
H  -0.805348 -0.507626 -0.774505
H  -5.055006 0.694661 0.229726
H  -5.008391 -0.824864 1.152228
H  -1.680472 1.32318 1.214235
H  -3.351217 1.903996 1.341268
H  1.641308 -3.332951 -0.098131
H  -4.306688 -2.06184 -0.981063
H  -4.465599 -0.505695 -1.887343
H  -3.41574 2.457613 -1.059567
H  -2.053651 1.31926 -1.405782
H  0.605423 1.631739 -0.30406
H  2.346904 3.221894 -0.29738
