program: Gaussian 09
title: 000242389
version: EM64L-G09RevD.01
frameworkgroup: C1[X(C8H13Cl3O3)]
method: RPBEPBE
basis: SDD
operation: Freq
keyword: #p
keyword: freq=noraman
keyword: PBEPBE/SDD
title: #p freq=noraman PBEPBE/SDD
converged: YES YES NO NO
title: Mulliken charges:
elementType: Cl Cl Cl O O O C C C C C C C C H H H H H H H H H H H H H
charge: 0.151766 0.120326 0.109619 -0.256447 -0.234831 -0.186403 -0.373554 -0.249129 -0.346865 -0.288929 -0.684711 -0.289093 0.492504 -0.732983 0.207011 0.204490 0.188340 0.202842 0.192594 0.198025 0.223431 0.206980 0.210619 0.212210 0.217220 0.236370 0.268597
chargesum: 0.00000
title: Mulliken charges with hydrogens summed into heavy atoms:
elementType: Cl Cl Cl O O O C C C C C C C C
charge: 0.151766 0.120326 0.109619 -0.256447 -0.234831 -0.186403 0.037947 0.142053 0.043753 0.141483 -0.044661 0.215874 0.492504 -0.732983
polarizability: 1.34883812e+02 -5.04009036e+00 1.31213408e+02 -3.32043542e+00 -7.91454286e+00 1.10233712e+02
1716.lowfreq: -1.7073 -0.0012 -0.0011 -0.0006 5.3638 8.6815 13.6667 28.7268 34.1258
frequency: 13.2299 28.7083 34.0871 45.3761 49.9784 76.1488 98.8438 123.2074 128.8883 151.7708 189.1861 214.8031 228.4854 250.4695 264.2970 286.0786 295.7162 316.9267 364.0382 383.0726 392.9745 427.6696 498.6384 605.3722 701.5377 732.8751 741.1198 754.2286 787.9931 809.2686 837.7676 902.0142 926.3653 937.9494 939.8271 1005.6207 1038.8584 1076.7724 1084.3742 1089.2795 1124.0830 1148.4865 1158.0407 1211.3647 1224.7093 1265.6163 1279.4382 1285.4987 1286.1079 1345.0232 1346.8830 1364.4744 1384.6243 1390.8410 1438.3946 1448.1401 1469.5429 1473.6456 1476.5228 1482.7124 1491.0162 1647.2738 2933.8042 2955.9009 2968.6173 2974.7603 2989.3366 2991.0959 3012.2047 3024.4235 3054.9486 3061.7804 3073.4396 3075.4717 3105.5139
redmass: 11.2124 6.7611 6.3714 1.8108 4.3226 6.5868 2.9586 4.1041 2.3985 4.0398 7.4245 14.5660 1.1259 8.0269 19.2640 3.7898 5.2597 3.8726 4.3854 5.0454 11.6004 3.5994 2.2990 13.0574 8.7775 6.2441 1.0761 11.9602 4.6810 1.1357 5.2457 1.8232 3.2687 2.2994 1.5495 2.7500 3.1542 2.6873 2.8179 3.0336 2.5834 1.5280 6.6507 1.3424 1.1787 1.1921 1.1918 1.0824 1.1751 1.2944 1.4703 1.2859 1.2945 1.2829 1.0863 1.0908 1.0742 1.0644 1.0426 1.0692 1.0909 11.2250 1.0550 1.0659 1.0586 1.0368 1.1017 1.0625 1.1008 1.0580 1.1042 1.0953 1.1014 1.0995 1.1084
irintensity: 0.0043 0.1227 2.5088 0.6239 0.4519 0.1028 1.1943 0.3480 0.7408 3.0452 2.0372 0.5131 0.0097 4.5947 0.7037 9.0256 5.3082 1.8151 10.4801 2.1292 5.1298 0.3778 9.2509 132.7474 27.8627 81.9898 7.1301 59.7693 49.2054 0.8783 25.0354 8.7326 47.8045 43.8743 8.5945 45.7457 2.9878 34.8624 47.6518 26.6261 0.7691 6.2651 255.1589 0.1674 9.4030 8.4186 3.5496 2.1943 18.9092 3.4478 0.6915 18.8009 6.2444 4.9382 6.8060 28.5978 0.6642 0.6782 12.6213 6.9976 16.7764 144.2896 44.1320 51.7307 36.1123 29.8976 21.5759 52.7204 3.2570 15.5296 20.5677 30.3609 97.3685 47.6521 9.1865
temp: 298.150 k
press: 1.00000 atm
elementType: 17 17 17 8 8 8 6 6 6 6 6 6 6 6 1 1 1 1 1 1 1 1 1 1 1 1 1
symmnumber: 1
zpe: 531127.3 jmol-1
zpe.correction: 0.202296 hartree
zpe.thermalcorrener: 0.219703 hartree
zpe.thermalcorrenthalpy: 0.220647 hartree
zpe.thermalcorrgfe: 0.152698 hartree
zpe.sumelectzpe: -1917.331584 hartree
zpe.sumelectthermal: -1917.314177 hartree
zpe.sumelectthermalent: -1917.313233 hartree
zpe.sumelectthermalfe: -1917.381182 hartree
dipole: 0.4860 1.7065 -1.2318
dipole: 2.1600
quadrupole: -109.4030 -95.8723 -108.9274
quadrupole: -5.5270 -1.6019 -0.4642
quadrupole: -4.6688 8.8619 -4.1932 -5.5270 -1.6019 -0.4642
hfenergy: -1917.5338801 hartree
pointgroup: C01 [X(C8H13Cl3O3)]
dipole: 0.1235493 0.7907932 -0.2855515 debye
polarizability: 136.6103163|-3.0409443|132.4335088|1.9540314|-3.3571419|107.2871075 unknown
InChI: InChI=1S/C8H13Cl3O3/c1-2-3-4-13-5-6-14-7(12)8(9,10)11/h2-6H2,1H3
charge 0 multiplicity 1
27 atoms
Cl -2.227657 -2.780564 -0.308767
Cl -3.301473 -0.376693 -1.788183
Cl -0.450808 -1.329823 -2.275701
O  2.000628 1.999625 0.555243
O  -0.980602 1.038647 -0.394107
O  -1.176423 -0.527538 1.330986
C  3.64678 0.233165 0.326857
C  2.200766 0.634314 0.025342
C  3.965269 -1.213121 -0.121599
C  0.821336 2.686175 0.046668
C  5.42186 -1.617127 0.191948
C  -0.517171 2.12134 0.539418
C  -1.285142 -0.190088 0.138424
C  -1.794473 -1.128677 -0.992254
H  3.821946 0.335163 1.415537
H  4.329614 0.945629 -0.175064
H  1.997424 0.620629 -1.067873
H  1.496598 -0.067856 0.520778
H  3.780582 -1.31338 -1.210643
H  3.269858 -1.916726 0.379465
H  0.917487 3.721153 0.421153
H  0.815573 2.710251 -1.065094
H  6.137909 -0.948633 -0.321866
H  5.624636 -1.554565 1.27759
H  5.63167 -2.652534 -0.132855
H  -1.310329 2.887258 0.487189
H  -0.438157 1.713775 1.562108
