program: Gaussian 09
title: 000242385
version: EM64L-G09RevD.01
frameworkgroup: C1[X(C7H11ClO2)]
method: RPBEPBE
basis: SDD
operation: Freq
keyword: #p
keyword: freq=noraman
keyword: PBEPBE/SDD
title: #p freq=noraman PBEPBE/SDD
converged: YES YES NO NO
title: Mulliken charges:
elementType: Cl O O C C C C C C C H H H H H H H H H H H
charge: -0.046162 -0.266805 -0.246533 0.000886 -0.343915 -0.052023 -0.625171 -0.233045 -0.116441 -0.739382 0.256353 0.206894 0.240030 0.244129 0.281282 0.263734 0.241208 0.253806 0.223760 0.225720 0.231674
chargesum: 0.00000
title: Mulliken charges with hydrogens summed into heavy atoms:
elementType: Cl O O C C C C C C C
charge: -0.046162 -0.266805 -0.246533 0.257238 0.103010 0.192106 -0.080155 0.008163 0.137365 -0.058228
polarizability: 9.43698042e+01 -1.92066018e+00 9.88955165e+01 2.44455824e+00 -2.65825786e+00 7.03819787e+01
1716.lowfreq: -0.0033 0.0012 0.0015 9.6105 17.2828 18.2286 27.0707 84.2321 95.2759
frequency: 26.7158 84.1510 95.2191 137.0684 175.4507 185.8071 213.5309 233.7727 313.0320 352.3838 416.6329 425.9768 587.3419 630.5214 688.9178 720.4828 751.0484 805.6409 844.9847 885.2754 910.0179 935.5966 975.6081 993.6688 1008.3114 1051.0817 1053.2090 1086.3235 1098.3589 1112.2638 1173.2562 1199.1697 1241.2006 1251.3453 1274.1897 1289.1183 1299.0397 1304.5289 1330.6570 1352.9035 1396.3080 1436.5624 1461.0388 1470.1238 1471.2345 1686.2740 2969.1136 2972.2448 3037.3708 3043.6745 3046.4786 3048.6812 3079.8435 3104.9490 3106.1200 3112.1343 3138.8933
redmass: 6.1600 2.5107 3.5450 1.8927 3.3220 2.8042 1.6637 2.8994 5.7323 3.4535 2.9800 3.6576 3.8601 3.9221 6.3932 2.6913 3.5813 2.6164 4.5024 1.8188 1.9272 2.4410 4.5432 1.0803 2.9673 1.9569 1.6703 3.1200 2.3671 2.3903 1.2134 1.2376 1.2611 1.2224 1.2797 1.2553 1.2735 1.3003 1.1574 1.3254 1.2324 1.1025 1.0473 1.0618 1.0837 6.2028 1.0368 1.0675 1.0861 1.0965 1.0864 1.0596 1.0975 1.0957 1.0982 1.0871 1.1083
irintensity: 0.3183 0.8921 5.1566 2.9259 0.7629 3.0882 2.8739 7.0929 1.0573 2.2863 4.2740 10.6314 6.0443 12.9383 48.3820 3.6616 6.2617 12.4091 68.3656 3.9343 20.0285 4.6367 38.3346 57.9538 72.7422 0.9386 3.3247 97.2413 6.7223 2.7326 1.6339 13.9617 1.8082 5.7589 6.8244 15.0663 19.1453 10.8999 5.2072 0.9517 13.7616 11.4831 15.3619 22.0907 5.6225 17.8022 26.8243 47.3434 23.0308 24.1806 18.1066 23.9422 14.7318 1.9720 21.4261 32.0720 12.6315
temp: 298.150 k
press: 1.00000 atm
elementType: 17 8 8 6 6 6 6 6 6 6 1 1 1 1 1 1 1 1 1 1 1
symmnumber: 1
zpe: 443185.6 jmol-1
zpe.correction: 0.168800 hartree
zpe.thermalcorrener: 0.179604 hartree
zpe.thermalcorrenthalpy: 0.180548 hartree
zpe.thermalcorrgfe: 0.130904 hartree
zpe.sumelectzpe: -883.008268 hartree
zpe.sumelectthermal: -882.997465 hartree
zpe.sumelectthermalent: -882.996521 hartree
zpe.sumelectthermalfe: -883.046165 hartree
dipole: 1.2864 0.0062 2.7516
dipole: 3.0374
quadrupole: -68.0257 -68.4349 -66.0972
quadrupole: 8.4801 -3.7168 -0.3459
quadrupole: -0.5064 -0.9157 1.4221 8.4801 -3.7168 -0.3459
hfenergy: -883.177069 hartree
pointgroup: C01 [X(C7H11Cl1O2)]
dipole: -0.2829719 0.3080675 1.1194221 debye
dipolederiv: -0.2235558 0.1235578 0.0386994 0.1537019 -0.4963413 -0.0820206 0.0656746 -0.147997 -0.2165354 -0.9776831 0.1887371 -0.0090658 0.1203895 -0.4966575 -0.0252218 -0.1032361 0.0649302 -0.4262679 -0.7947243 -0.0775673 -0.0754202 -0.025289 -0.6142293 -0.0263695 -0.0998814 -0.0900454 -0.5094214 0.641252 -0.0321097 0.0908811 0.0989659 0.0963849 -0.0754545 0.2796513 -0.2970447 0.1759204 0.4052027 0.0377395 0.0285936 -0.1003398 0.171808 -0.1316282 0.0160082 0.0628176 0.3781386 1.1721332 0.1326625 -0.0527672 0.0098158 0.6695747 0.0465911 -0.0697795 0.0292031 0.5958537 0.218625 -0.1703288 -0.0529123 -0.1974168 0.5704267 0.2538399 -0.1256314 0.2683268 0.1982447 -0.2739332 -0.1641014 -0.0734726 -0.2161383 -0.1300903 0.0907895 -0.0750742 0.0506053 -0.2537813 0.0653108 0.1091207 -0.2149637 0.1169211 0.167785 -0.0681518 -0.2255867 -0.0415497 -0.046052 -0.0443145 -0.0780517 0.0923615 -0.1428702 -0.0310853 0.0793355 0.0931832 0.0456674 0.0338288 -0.1307899 -0.0156517 0.0418471 -0.0301791 0.0529308 0.0111 0.0545603 0.0383821 -0.0024277 0.0191059 -0.0002774 0.075326 0.0212938 0.0401655 0.1165066 0.0034772 0.0653404 -0.1478432 -0.0524626 -0.1014677 -0.0523181 -0.0856611 0.0090864 -0.0351982 -0.025063 -0.0044073 0.0777772 -0.0574867 -0.0275111 -0.0114215 0.0147867 -0.0038989 0.087376 -0.0453037 0.0851987 -0.0695628 -0.0098726 -0.0298144 0.1059829 0.0151238 -0.015004 -0.0389759 0.0966982 -0.0412303 0.0190021 -0.0283445 0.0183109 -0.0877316 0.0225288 -0.0127936 -0.0820286 -0.0757918 -0.0605431 -0.0148561 0.0068635 0.0757935 0.0887593 0.0708622 0.000857 -0.0321687 0.1303089 -0.0363411 0.0988045 0.0544988 0.0602428 0.0903155 0.0813683 0.0146436 -0.0324584 0.0932893 -0.0354762 0.0803956 0.0379029 0.0341352 -0.0619797 0.0390312 0.0255281 0.1095415 0.0101284 0.1469689 -0.0468835 0.0112047 0.0448475 0.0657247 0.1336029 -0.0520905 -0.0936033 0.0728359 -0.034085 0.0544267 -0.0389325 -0.1282662 -0.0264383 -0.1004977 0.0329997 -0.0718006 -0.0704677 -0.0687208 0.0212392 unknown
polarizability: 92.6101556|0.2283074|99.9734104|-5.0712642|0.2745183|71.0637333 unknown
InChI: InChI=1S/C7H11ClO2/c1-2-3-7-9-5-6(4-8)10-7/h2-3,6-7H,4-5H2,1H3
charge 0 multiplicity 1
21 atoms
Cl 2.250096 -2.410429 -0.505826
O  0.318829 0.134985 -1.294229
O  0.106103 2.267388 -0.324749
C  1.472932 0.303512 -0.370644
C  1.108869 1.556649 0.486767
C  -0.664959 1.188944 -0.978697
C  1.683669 -0.926201 0.505564
C  -1.797235 0.695187 -0.098336
C  -2.073892 -0.614008 0.13019
C  -3.221233 -1.123479 0.969762
H  2.3613 0.485268 -1.001253
H  0.681456 1.262673 1.467814
H  1.954893 2.244465 0.632168
H  -1.024098 1.61294 -1.932692
H  0.75246 -1.232744 1.003151
H  2.486314 -0.75598 1.24136
H  -2.427232 1.491349 0.32329
H  -1.427788 -1.36545 -0.34775
H  -2.855919 -1.766855 1.793946
H  -3.808875 -0.298347 1.408539
H  -3.90359 -1.749367 0.362426
