program: Gaussian 09
title: 000242379
version: EM64L-G09RevD.01
frameworkgroup: C1[X(C15H30O2)]
method: RPBEPBE
basis: SDD
operation: Freq
keyword: #pfreq=noraman
keyword: PBEPBE/SDD
title: #p freq=noraman PBEPBE/SDD
converged: YES YES NO NO
title: Mulliken charges:
elementType: O O C C C C C C C C C C C C C C C H H H H H H H H H H H H H H H H H H H H H H H H H H H H H H
charge: -0.264758 -0.268000 0.383905 0.362538 -0.426312 -0.432040 -0.443327 -0.397287 -0.458581 -0.370721 -0.730930 -0.725202 -0.739263 -0.368378 -0.357878 -0.355132 -0.698138 0.181635 0.229799 0.231354 0.185024 0.194339 0.211127 0.251302 0.195242 0.203028 0.203526 0.214081 0.214334 0.212415 0.233575 0.233578 0.222844 0.228618 0.218034 0.222988 0.216043 0.219695 0.183985 0.184552 0.188902 0.188767 0.194007 0.193796 0.213673 0.209632 0.209613
chargesum: 0.00000
title: Mulliken charges with hydrogens summed into heavy atoms:
elementType: O O C C C C C C C C C C C C C C C
charge: -0.264758 -0.268000 0.383905 0.362538 -0.014878 -0.015661 -0.037861 0.049256 -0.052028 0.057694 -0.051362 -0.055706 -0.080538 0.000158 0.019790 0.032671 -0.065220
polarizability: 1.95653389e+02 2.59135868e+00 1.66613467e+02 2.37601707e+00 -2.59896458e-01 1.40738582e+02
1716.lowfreq: 0.0004 0.0005 0.0007 3.1636 8.3466 13.1924 32.1301 39.2261 46.2328
frequency: 31.9568 38.9860 46.0157 76.0829 81.1236 86.7937 101.2061 113.1440 133.5661 140.7104 154.9167 181.6450 202.5086 216.8045 227.2607 230.2535 233.2055 271.6264 276.5479 296.4248 305.5118 324.7288 370.9108 401.2514 402.5283 423.1821 440.1837 456.2182 498.5060 520.0465 562.1125 644.6432 698.8223 718.6898 723.9397 730.3581 750.8328 761.2514 787.1477 808.5574 880.9979 886.0297 907.9620 916.6354 923.1866 933.2118 954.9594 976.9539 993.3245 1002.9179 1008.0044 1024.2979 1035.3687 1043.1493 1054.2558 1061.8105 1068.5795 1073.1395 1082.3701 1089.3187 1133.5737 1158.1502 1168.8147 1178.0823 1196.0244 1201.4716 1230.6277 1231.6297 1244.2056 1250.6891 1267.6097 1281.6111 1283.1936 1286.2853 1288.4598 1297.8941 1311.5184 1333.0469 1335.6167 1347.3876 1351.5648 1354.4533 1360.1644 1366.9584 1378.1038 1390.2681 1391.0505 1394.8352 1441.2793 1455.0366 1459.7830 1463.2508 1465.2299 1466.1785 1470.8343 1475.0453 1477.8927 1480.8558 1480.9971 1482.8401 1484.0999 1488.2409 1489.0790 1490.1438 1494.7492 2935.8459 2942.9548 2946.7542 2955.3163 2961.7226 2967.2319 2971.3243 2979.0560 2982.4467 2984.9681 2985.3978 2986.2189 2995.4622 2999.6091 3002.7792 3010.1475 3028.4969 3037.7139 3044.3628 3063.7927 3066.0325 3067.2750 3068.5474 3069.1149 3071.7228 3074.7957 3076.6294 3081.5487 3096.1838 3100.4045
redmass: 3.6006 3.2916 1.5628 2.8337 2.8912 2.3726 2.0787 1.6632 2.6270 1.8650 2.9278 1.4909 1.4534 2.3294 3.1099 1.3130 1.1320 2.0070 2.7097 2.7223 2.0868 2.1843 3.0260 2.5183 2.0651 3.5657 2.9499 2.7297 3.7043 3.9600 3.4444 3.6691 4.4543 1.4984 1.1654 2.6683 1.2678 1.2841 1.2774 1.3840 1.2829 1.8925 2.1743 1.8893 1.8139 1.8693 5.4128 1.2093 3.2289 1.5725 2.6955 2.2621 3.0206 1.3158 3.0134 1.9144 2.5219 2.1914 2.1881 2.6414 3.3670 1.9147 2.2516 1.8546 1.7604 1.9405 1.2470 1.3071 2.5236 1.2963 1.3323 1.0379 1.1718 1.3601 1.1712 1.1192 1.3780 1.3203 1.4832 1.3890 1.5460 1.6857 1.5917 1.3737 1.2299 1.2182 1.2171 1.2036 1.0844 1.0670 1.0750 1.0668 1.0742 1.0597 1.0677 1.0688 1.0430 1.0548 1.0546 1.0626 1.0772 1.0493 1.0898 1.0537 1.0693 1.0679 1.0685 1.0588 1.0587 1.0607 1.0583 1.0371 1.0366 1.0506 1.0959 1.0500 1.0599 1.0570 1.0377 1.1011 1.0986 1.1032 1.1012 1.0954 1.0947 1.1037 1.0950 1.1013 1.0993 1.0974 1.0990 1.0989 1.0998 1.0986 1.1001
irintensity: 0.1903 0.1924 0.0187 0.2916 0.2054 0.0207 0.2586 0.0545 0.4086 0.9876 0.7839 0.0015 0.2838 2.7505 0.0440 0.8565 0.0082 0.5445 4.7467 3.7652 1.4523 0.0235 1.7489 0.4132 1.4799 9.2188 1.0828 0.4603 3.9782 5.1163 3.3118 1.5809 5.3004 1.2519 18.6324 4.2923 2.1415 14.7295 12.3961 28.9749 2.9259 6.4086 0.2020 7.9664 2.5182 23.1251 16.4801 0.0159 20.0700 2.4887 46.1213 6.1319 12.4684 19.6088 7.3843 27.2801 6.1585 3.4376 7.0166 102.7193 18.0724 10.9535 5.3984 25.0917 1.8813 9.2921 6.4764 12.3694 58.3079 2.4097 1.3258 0.2254 2.5666 9.3321 1.6335 4.0787 0.3885 1.2928 2.6819 0.4437 0.0586 2.4927 4.0464 22.8154 21.5908 10.4785 19.0286 16.5653 4.1350 7.4210 3.4408 0.2593 0.3317 2.3775 12.0505 2.3026 11.6883 5.7483 14.8335 13.6094 0.6846 6.7877 29.3344 4.0813 5.3475 32.1739 72.9642 13.6132 11.9232 65.7928 87.1419 33.9437 34.9377 3.4547 5.0545 43.1543 5.3263 44.2775 41.3870 3.0659 27.9225 45.5224 4.3779 0.7683 15.5340 7.4329 47.2124 133.2290 65.0655 33.6595 59.1829 57.9297 41.5746 37.4743 20.7726
temp: 298.150 k
press: 1.00000 atm
elementType: 8 8 6 6 6 6 6 6 6 6 6 6 6 6 6 6 6 1 1 1 1 1 1 1 1 1 1 1 1 1 1 1 1 1 1 1 1 1 1 1 1 1 1 1 1 1 1
symmnumber: 1
zpe: 1112642.8 jmol-1
zpe.correction: 0.423783 hartree
zpe.thermalcorrener: 0.444779 hartree
zpe.thermalcorrenthalpy: 0.445724 hartree
zpe.thermalcorrgfe: 0.374057 hartree
zpe.sumelectzpe: -738.608679 hartree
zpe.sumelectthermal: -738.587683 hartree
zpe.sumelectthermalent: -738.586738 hartree
zpe.sumelectthermalfe: -738.658404 hartree
dipole: -2.2119 0.2420 0.0265
dipole: 2.2253
quadrupole: -101.7149 -105.8044 -111.1458
quadrupole: 0.5840 0.0041 0.3656
quadrupole: 4.5068 0.4173 -4.9241 0.5840 0.0041 0.3656
hfenergy: -739.0324619 hartree
pointgroup: C01 [X(C15H30O2)]
dipole: -0.8707543 -0.0909127 0.0007703 debye
polarizability: 195.5740393|-2.8173361|166.6083033|-2.8476292|-0.9306459|140.8230955 unknown
InChI: InChI=1S/C15H30O2/c1-5-8-9-10-11-14(4)16-12-15(6-2,7-3)13-17-14/h5-13H2,1-4H3
charge 0 multiplicity 1
47 atoms
O  -0.798647 -0.847268 -1.232517
O  -0.828236 -0.903377 1.193461
C  -2.552225 0.47763 -0.00775
C  -0.473871 -1.647419 -0.0329
C  -2.191015 -0.365295 -1.262972
C  -2.22186 -0.419019 1.219414
C  -4.083712 0.759589 -0.051337
C  -1.693625 1.775844 0.062323
C  1.056854 -1.792565 -0.016687
C  1.832386 -0.459245 0.01302
C  -1.1806 -3.019564 -0.073008
C  -4.641215 1.61122 1.11189
C  -1.928598 2.8019 -1.067385
C  3.361459 -0.678125 0.0364
C  4.166104 0.641003 0.0544
C  5.696288 0.423769 0.082284
C  6.49529 1.745128 0.094721
H  -2.896202 -1.220621 -1.355096
H  -2.255871 0.231506 -2.187985
H  -2.289949 0.14424 2.165251
H  -2.930463 -1.275748 1.267804
H  -4.620213 -0.212594 -0.071624
H  -4.32646 1.25895 -1.011018
H  -0.630599 1.47263 0.067033
H  -1.8786 2.265472 1.039791
H  1.344852 -2.373877 -0.914365
H  1.322672 -2.400942 0.869737
H  1.551026 0.139824 -0.873825
H  1.521012 0.117449 0.90471
H  -2.28038 -2.935268 -0.078231
H  -0.875031 -3.564939 -0.982403
H  -0.887949 -3.609671 0.812426
H  -4.459058 1.138119 2.093949
H  -4.188575 2.618558 1.13347
H  -5.733865 1.73965 1.004732
H  -1.704238 2.37729 -2.062868
H  -2.969388 3.175249 -1.083096
H  -1.265755 3.675966 -0.931198
H  3.663015 -1.276162 -0.849941
H  3.634663 -1.28372 0.92671
H  3.866046 1.242314 0.938165
H  3.898953 1.245909 -0.837379
H  5.961643 -0.178589 0.975258
H  5.993475 -0.180899 -0.79908
H  7.585508 1.561395 0.114133
H  6.239207 2.354336 0.982305
H  6.27045 2.351866 -0.802922
