program: Gaussian 09
title: 000242312
version: EM64L-G09RevD.01
frameworkgroup: C1[X(C15H23NO2)]
method: RPBEPBE
basis: SDD
operation: Freq
keyword: #p
keyword: freq=noraman
keyword: PBEPBE/SDD
title: #p freq=noraman PBEPBE/SDD
converged: YES YES NO NO
title: Mulliken charges:
elementType: O O N C C C C C C C C C C C C C C C H H H H H H H H H H H H H H H H H H H H H H H
charge: -0.311957 -0.270109 -0.462320 -0.377067 -0.371243 -0.376295 -0.352611 -0.394441 -0.356475 -0.270730 -0.695710 0.254753 0.481856 -0.444853 -0.357704 -0.196046 -0.210730 -0.258176 0.194001 0.194030 0.190484 0.190467 0.195298 0.195327 0.188211 0.188219 0.212057 0.212085 0.195352 0.195351 0.226654 0.226678 0.209767 0.215953 0.209769 0.328169 0.221871 0.299772 0.225886 0.225995 0.228462
chargesum: 0.00000
title: Mulliken charges with hydrogens summed into heavy atoms:
elementType: O O N C C C C C C C C C C C C C C C
charge: -0.311957 -0.270109 -0.134151 0.010964 0.009709 0.014330 0.023819 0.029700 0.034228 0.182602 -0.060221 0.254753 0.481856 -0.222982 -0.057932 0.029840 0.015265 -0.029713
polarizability: 2.77643645e+02 4.68229930e+00 1.64525507e+02 -8.06903201e-02 2.59732941e-02 1.06389720e+02
1716.lowfreq: -9.4589 -0.0016 0.0010 0.0015 3.3259 5.3427 17.0133 26.2966 42.8851
frequency: 12.5437 26.2936 42.3086 48.9481 66.3987 73.4233 75.1622 88.7007 107.8174 132.0805 143.0985 150.5245 150.7761 166.4717 218.0942 227.5815 250.5156 291.7766 327.2350 342.1268 399.5629 407.1837 456.3102 484.8123 508.9300 600.2879 615.8373 642.9259 695.7317 701.4478 710.5185 723.8843 731.6850 754.7401 765.8528 795.0134 825.4693 840.0214 861.1675 887.3490 908.3577 912.6225 939.4935 971.0542 983.8203 990.6529 995.5109 1003.7759 1011.8938 1024.5642 1032.0471 1048.7530 1077.9345 1079.7979 1086.8261 1089.9159 1125.6818 1153.5715 1160.6032 1172.4585 1188.7402 1188.9590 1221.3528 1224.1826 1259.1043 1259.9891 1264.7956 1277.1901 1284.4310 1296.3793 1298.4914 1303.5383 1323.5645 1337.6130 1354.9416 1358.2045 1373.1402 1388.0905 1390.3962 1434.7172 1463.0598 1464.1470 1468.4076 1470.8774 1476.7197 1477.0705 1482.6646 1485.9176 1488.5341 1491.9073 1519.8387 1600.8769 1618.6846 1663.2808 2952.2778 2954.0084 2957.7466 2964.5427 2969.9644 2972.6971 2986.8359 2989.4327 2995.0713 3000.6742 3007.2783 3023.3519 3037.5347 3046.6399 3069.2045 3071.5322 3074.8711 3112.0902 3132.0530 3144.3177 3165.6036 3189.1946 3541.8946
redmass: 4.9227 4.6113 3.2942 1.9707 4.7592 2.8716 4.3635 2.0535 2.4348 2.0304 4.3184 2.1626 4.7377 2.8705 4.6001 1.1326 4.3113 4.0299 4.3443 6.3417 3.6558 2.9197 3.6540 3.2213 2.8368 6.0587 6.4087 1.2897 2.1272 4.8236 8.6092 1.0619 1.0807 1.1070 1.6724 1.1594 5.5288 1.2664 1.2047 1.9941 6.9558 1.4317 1.1943 1.3543 6.1206 4.8897 1.3047 6.2872 1.1115 3.1516 2.4707 3.2611 2.4600 2.2872 2.3260 1.5541 2.9682 1.4570 3.3401 1.0507 1.1137 1.6458 1.2864 1.3803 1.2426 2.0144 1.3332 1.1124 1.0563 1.1197 1.0955 1.3285 1.4085 1.4074 1.6012 1.6206 1.6146 5.3302 1.2186 2.3792 1.0719 1.0733 1.0686 1.0810 1.0796 1.0422 1.0948 2.1169 1.1056 1.1058 2.2232 5.2536 6.0653 8.5269 1.0588 1.0588 1.0592 1.0591 1.0587 1.0366 1.0968 1.0596 1.0991 1.0565 1.1020 1.1040 1.1043 1.1048 1.1007 1.0993 1.1081 1.0885 1.0868 1.0934 1.0996 1.0953 1.0760
irintensity: 0.0456 0.1355 0.1589 0.6589 2.0701 1.0747 0.1791 0.5601 0.0010 1.1770 0.3976 0.0696 0.6076 3.1270 7.6995 0.0001 3.6452 2.9047 4.0839 9.6811 1.8575 0.0052 2.6606 1.0105 26.0288 1.0262 2.6902 29.9721 20.1791 63.2035 19.3678 14.7908 0.2204 4.0284 106.6484 0.1692 5.1970 0.4484 0.5664 5.3158 7.5790 13.6574 0.7632 0.0713 16.5795 34.2778 2.4724 171.2370 0.0659 27.0839 44.0492 18.4959 4.5248 17.0312 72.7209 29.6204 1.2307 1.0471 498.3464 0.7615 9.4957 0.0057 14.1117 0.0683 0.0598 5.8698 1.1184 0.5016 0.5551 0.0931 0.0709 0.0859 62.8498 0.1242 2.8923 0.8634 45.7341 30.8685 11.2495 109.7145 0.0643 0.0326 1.1536 0.3394 7.6544 12.4673 1.0337 12.1060 19.4082 37.6817 525.5843 34.1788 109.2221 223.7461 0.1893 1.0417 0.7064 18.1371 149.5820 36.5039 0.0228 19.5912 0.2966 49.1009 1.0747 0.0270 61.4380 59.4635 88.8718 54.6743 91.5394 14.6506 0.7588 31.4124 24.3653 6.5249 28.1250
temp: 298.150 k
press: 1.00000 atm
elementType: 8 8 7 6 6 6 6 6 6 6 6 6 6 6 6 6 6 6 1 1 1 1 1 1 1 1 1 1 1 1 1 1 1 1 1 1 1 1 1 1 1
symmnumber: 1
zpe: 925183.3 jmol-1
zpe.correction: 0.352384 hartree
zpe.thermalcorrener: 0.372299 hartree
zpe.thermalcorrenthalpy: 0.373244 hartree
zpe.thermalcorrgfe: 0.300374 hartree
zpe.sumelectzpe: -789.223650 hartree
zpe.sumelectthermal: -789.203734 hartree
zpe.sumelectthermalent: -789.202790 hartree
zpe.sumelectthermalfe: -789.275659 hartree
dipole: -1.4333 2.1482 0.0008
dipole: 2.5824
quadrupole: -101.5505 -108.0748 -112.5859
quadrupole: 8.2180 -0.0117 0.0024
quadrupole: 5.8532 -0.6710 -5.1821 8.2180 -0.0117 0.0024
hfenergy: -789.5760333 hartree
pointgroup: C01 [X(C15H23N1O2)]
dipole: 0.5599037 0.8478137 0.0012172 debye
polarizability: 277.6843508|-4.1475058|164.4834332|-0.4206314|0.1599023|106.3910876 unknown
InChI: InChI=1S/C15H23NO2/c1-2-3-4-5-6-10-13-18-15(17)16-14-11-8-7-9-12-14/h7-9,11-12,16H,2-6,10,13H2,1H3
charge 0 multiplicity 1
41 atoms
O  -0.586722 0.253687 -0.001053
O  -1.944247 -1.674005 -0.001807
N  -2.826574 0.532102 0.005801
C  4.4121 0.391026 -0.008616
C  5.73735 -0.403794 -0.011286
C  3.159523 -0.514026 -0.008967
C  6.990879 0.499951 -0.011041
C  1.839958 0.293101 -0.005312
C  8.317333 -0.294119 -0.013426
C  0.616852 -0.623896 -0.005826
C  9.564178 0.616554 -0.01314
C  -1.822658 -0.423691 0.000754
C  -4.232699 0.322655 0.009395
C  -5.063624 1.475644 0.014797
C  -4.820481 -0.97024 0.007833
C  -6.466127 1.339503 0.018631
C  -6.227115 -1.087644 0.011719
C  -7.059157 0.0552 0.017122
H  4.384566 1.054743 0.880613
H  4.382835 1.05787 -0.895444
H  5.764947 -1.068079 -0.900419
H  5.766716 -1.070997 0.875604
H  3.190646 -1.180792 0.877772
H  3.188261 -1.176859 -0.898725
H  6.965217 1.164603 0.877957
H  6.963646 1.167277 -0.897985
H  1.803061 0.948567 0.886203
H  1.800671 0.952882 -0.893534
H  8.343766 -0.960686 0.872839
H  8.342187 -0.957987 -0.90176
H  0.580358 -1.268977 -0.903425
H  0.583587 -1.274275 0.888062
H  9.576216 1.27154 -0.904866
H  10.498717 0.025853 -0.015014
H  9.577944 1.268616 0.880701
H  -2.49526 1.499353 0.007251
H  -4.611043 2.475687 0.016025
H  -4.179619 -1.854325 0.003692
H  -7.094449 2.237072 0.022802
H  -6.674466 -2.088055 0.010478
H  -8.148974 -0.051137 0.020095
