program: Gaussian 09
title: 000242309
version: EM64L-G09RevD.01
frameworkgroup: C1[X(C8H5ClF3NO)]
method: RPBEPBE
basis: SDD
operation: Freq
keyword: #p
keyword: freq=noraman
keyword: PBEPBE/SDD
title: #p freq=noraman PBEPBE/SDD
converged: NO NO NO NO
title: Mulliken charges:
elementType: Cl F F F O N C C C C C C C C H H H H H
charge: -0.035457 -0.166033 -0.160486 -0.160499 -0.235989 -0.406377 0.336452 0.616653 -0.417760 -0.399852 -0.359540 -0.193521 0.258443 -0.057851 0.339449 0.276034 0.265531 0.316669 0.184136
chargesum: 0.00000
title: Mulliken charges with hydrogens summed into heavy atoms:
elementType: Cl F F F O N C C C C C C C C
charge: -0.035457 -0.166033 -0.160486 -0.160499 -0.235989 -0.089708 0.336452 0.616653 -0.078311 -0.123818 -0.359540 0.072010 0.258443 0.126285
polarizability: 1.42160514e+02 -3.44827335e+00 1.34326125e+02 -2.53735327e-03 1.66787210e-03 4.80976694e+01
1716.lowfreq: -7.0576 -0.0022 0.0005 0.0011 1.8802 7.7928 11.1102 70.7258 80.3912
frequency: -5.8176 70.7148 80.3886 113.5927 149.2200 182.8709 216.8136 226.3754 266.8384 326.7939 342.9016 361.0047 403.6389 444.1242 457.8960 492.4918 517.6587 538.9733 629.8214 638.8998 689.2145 696.4820 733.8463 800.0434 823.2039 875.8766 939.4911 955.2287 959.8207 992.9340 1006.3226 1018.6019 1054.9627 1110.5816 1159.3219 1234.1618 1256.8665 1309.4812 1370.5552 1385.5138 1431.4158 1444.7559 1519.8577 1596.4716 1609.6727 1639.3650 2953.6192 3169.8328 3175.9440 3189.3296 3480.2947
redmass: 15.6282 7.4566 9.7015 11.4640 3.9497 11.9106 5.8017 13.8626 18.2062 12.7935 4.9230 4.4197 7.7560 4.7523 9.2987 5.2732 8.0138 8.4385 12.5590 4.5813 7.6892 1.3219 3.2767 7.4113 1.3430 7.1281 1.4883 1.4544 1.4507 9.3968 7.7106 6.6866 4.3155 2.4932 1.3911 2.1747 1.6712 2.2470 1.9102 2.5516 4.0954 2.3739 2.3465 6.1475 6.8403 4.8033 1.0876 1.0895 1.0939 1.0973 1.0769
irintensity: 0.0001 1.1753 7.3147 0.4945 8.9762 10.2280 8.4235 3.2586 0.3938 7.0162 10.9060 0.5588 8.6310 4.3368 18.8658 3.5750 12.0914 10.4237 1.1792 0.1698 4.0410 80.9712 6.2509 2.4079 65.8771 50.0575 49.5870 10.1341 5.0340 204.6878 178.8403 53.3102 130.9996 28.2061 4.0488 46.5833 137.0069 139.5654 19.8838 37.6380 201.7458 33.8298 244.7859 40.1727 99.7410 145.5084 98.2814 0.0930 16.2672 0.4820 46.4631
temp: 298.150 k
press: 1.00000 atm
elementType: 17 9 9 9 8 7 6 6 6 6 6 6 6 6 1 1 1 1 1
symmnumber: 1
zpe: 311292.8 jmol-1
zpe.correction: 0.118565 hartree
zpe.thermalcorrener: 0.130220 hartree
zpe.thermalcorrenthalpy: 0.131164 hartree
zpe.thermalcorrgfe: 0.080047 hartree
zpe.sumelectzpe: -1196.416969 hartree
zpe.sumelectthermal: -1196.405315 hartree
zpe.sumelectthermalent: -1196.404371 hartree
zpe.sumelectthermalfe: -1196.455488 hartree
dipole: -4.9243 -2.7478 -0.0010
dipole: 5.6390
quadrupole: -84.8991 -88.3296 -89.0634
quadrupole: -8.0647 -0.0036 0.0007
quadrupole: 2.5316 -0.8989 -1.6327 -8.0647 -0.0036 0.0007
hfenergy: -1196.5355345 hartree
pointgroup: C01 [X(C8H5Cl1F3N1O1)]
dipole: 1.7387154 1.3780081 -0.0017474 debye
dipolederiv: -0.6694016 -0.2575245 0.0003576 -0.2119192 -0.2398095 0.0001496 0.0003401 0.0001713 -0.0407205 -0.7589268 0.23816 -0.0009226 0.1682238 -0.5061096 0.0009368 -0.0004524 0.0008874 -0.2882944 -0.5357412 -0.138586 -0.1005045 -0.2407987 -0.4757948 -0.2599763 -0.1318707 -0.2241929 -0.6297934 -0.536593 -0.1383177 0.1014654 -0.2404801 -0.4732019 0.2591467 0.1338932 0.2237313 -0.6327265 -0.4434865 -0.5429215 0.0001656 0.1035875 -1.0398114 0.0001005 0.0000239 0.0005425 -0.3390923 -0.6366009 0.4887037 0.0000393 0.5739224 -1.5080844 0.0000578 -0.0000141 0.0000644 -0.3059636 -0.3490231 -0.1699549 0.0000777 -0.0727272 0.0066312 -0.0000734 -0.0006908 -0.0002708 -0.1603722 0.4470929 -0.8954985 0.0000432 -0.5148808 0.3389497 0.0002069 0.0000175 0.0003557 0.1302128 -0.1129975 0.3175655 -0.0000354 -0.1327873 -0.0950346 0.0000814 0.0001719 0.0000251 -0.1085602 -0.0291279 -0.0302656 -0.0000396 0.1403361 -0.0734912 -0.0000662 0.0000812 0.0000105 -0.1272883 0.9015878 0.4676786 -0.0005622 0.5078779 0.1665896 -0.0003154 -0.0005726 -0.0002896 -0.1007799 -0.2433089 0.0039355 0.0000897 -0.0889198 0.0456608 -0.0000038 0.0001523 -0.0000414 -0.0681475 2.0779928 0.1494042 -0.0001782 0.39554 1.402376 -0.0000931 -0.001231 -0.0003235 1.553476 0.6984112 0.3596372 -0.0003 -0.3355765 1.9918872 -0.0003117 -0.0000842 -0.0007714 0.160505 0.1458435 -0.0293714 0.0000271 -0.052758 0.1320491 0.000047 0.0000098 -0.0000001 0.180592 0.0433414 0.0500359 0.0000473 0.0458783 0.0689605 -0.0000019 0.0000358 0.0000283 0.1699373 0.0919543 -0.0321994 0.0000343 -0.0248815 -0.0136796 0.0000637 0.0000173 0.0000647 0.1653435 0.1661093 0.0393645 0.0000569 -0.0217951 0.2295212 0.0000295 0.0000705 -0.0000099 0.315139 -0.2571258 0.1201544 0.0001385 0.0021583 0.0423915 0.0000219 0.0001024 0.0000183 0.1265331 unknown
polarizability: 143.0512361|-2.0294695|133.4353713|-0.0495524|-0.0229352|48.0977019 unknown
InChI: InChI=1S/C8H5ClF3NO/c9-6-2-1-5(8(10,11)12)3-7(6)13-4-14/h1-4,13H
charge 0 multiplicity 1
19 atoms
Cl 3.18552 2.141052 -0.002005
F  -3.471723 0.752649 -0.001631
F  -2.688161 -1.057197 -1.127698
F  -2.689008 -1.050365 1.135776
O  1.588167 -2.985022 0.000072
N  2.502213 -0.804213 -0.001016
C  -1.072009 0.369382 0.000322
C  1.3493 0.013976 -0.000685
C  0.031085 -0.511619 0.000035
C  -0.903116 1.77036 -0.000087
C  1.500669 1.430692 -0.001086
C  0.403395 2.302814 -0.000832
C  -2.451882 -0.228107 0.001589
C  2.569141 -2.197225 -0.000724
H  -0.098374 -1.596735 0.000264
H  -1.76949 2.436025 0.000088
H  0.565269 3.38391 -0.001196
H  3.397655 -0.303118 -0.001524
H  3.62535 -2.547861 -0.00096
