program: Gaussian 09
title: 000242301
version: EM64L-G09RevD.01
frameworkgroup: C1[X(C12H12N2O3)]
method: RPBEPBE
basis: SDD
operation: Freq
keyword: #p
keyword: freq=noraman
keyword: PBEPBE/SDD
title: #p freq=noraman PBEPBE/SDD
converged: YES YES NO NO
title: Mulliken charges:
elementType: O O O N N C C C C C C C C C C C C H H H H H H H H H H H H
charge: -0.290381 -0.279628 -0.218968 -0.082186 -0.369919 -0.416639 0.137558 -0.477060 0.156966 0.139563 0.147758 -0.326670 -0.336011 0.244616 -0.221110 -0.214854 -0.765606 0.249819 0.279767 0.244316 0.279273 0.340215 0.278845 0.277967 0.238716 0.239001 0.247701 0.259846 0.237106
chargesum: 0.00000
title: Mulliken charges with hydrogens summed into heavy atoms:
elementType: O O O N N C C C C C C C C C C C C
charge: -0.290381 -0.279628 -0.218968 -0.082186 -0.029704 0.112946 0.137558 0.046528 0.156966 0.139563 0.147758 -0.047825 -0.058045 0.244616 0.017607 0.024147 -0.020954
polarizability: 2.12547637e+02 4.11892782e+00 1.61057762e+02 -1.66454017e+01 8.57153456e-01 8.71129322e+01
1716.lowfreq: -9.6635 -5.5651 0.0001 0.0002 0.0004 3.6671 20.6539 25.2599 33.4598
frequency: 20.3231 25.2181 33.3963 70.8832 94.9700 119.3009 123.7390 165.6493 183.5826 215.3659 247.2815 290.8024 302.2654 360.3566 396.1567 410.2817 440.6437 457.8004 463.0786 475.6433 517.3301 534.6494 574.7287 628.6394 649.0211 665.6862 685.5218 716.1190 749.9891 780.9661 797.6243 811.6062 831.5452 916.3046 917.4112 935.3552 972.0626 994.9127 1014.4903 1028.2468 1047.6805 1058.7200 1086.0690 1123.4866 1160.9829 1171.0826 1173.9447 1186.7569 1234.9387 1262.0233 1279.1480 1307.0816 1321.5176 1343.2196 1364.2957 1371.8231 1397.3376 1429.4828 1439.9549 1442.4448 1450.0426 1454.7484 1463.9925 1478.3530 1558.1707 1582.5131 1616.2391 1627.0747 1631.9207 2974.5128 2981.9472 3030.1246 3048.8413 3065.9301 3102.0585 3123.8415 3138.0313 3152.2924 3164.7379 3173.9153 3537.3045
redmass: 6.0671 4.7590 5.3613 1.9902 7.5056 1.1206 4.4106 5.9997 8.0897 5.1505 4.6609 5.8643 3.0563 8.2486 2.8241 2.7650 4.9561 3.4586 8.4852 2.9687 7.3766 1.3613 4.5637 4.6095 4.8495 5.1346 3.9863 3.9766 1.5994 4.7974 1.4386 4.2826 3.1511 1.7021 1.4207 2.4161 2.9011 1.3780 1.3410 2.2433 2.4084 3.2754 2.3775 2.2702 1.7258 1.8530 1.2267 2.2753 1.8271 1.6188 1.8877 1.8162 2.8000 2.2987 1.3878 1.2510 10.4975 1.2597 1.2517 1.0690 1.8024 1.0718 2.6383 1.9285 7.7688 6.6281 6.7351 6.6366 7.4994 1.0622 1.0406 1.0626 1.0930 1.0953 1.1034 1.1004 1.0863 1.0902 1.0949 1.1003 1.0790
irintensity: 0.3068 5.9323 0.9480 0.6964 12.9833 0.0999 0.7580 5.8605 0.0557 0.9461 1.1913 2.9643 0.1141 22.8617 1.2241 16.6243 10.0523 2.2966 3.0565 1.0481 9.9906 73.5881 3.7737 0.7216 1.6028 2.2815 84.3193 3.4545 5.2525 0.4942 52.3147 4.0450 3.3950 8.9933 0.3343 6.4942 9.7275 3.7942 0.0178 11.9513 11.9376 3.2481 7.9811 45.0149 3.5178 95.5469 0.4510 12.4327 74.7682 11.8671 27.1599 126.8296 114.9345 2.0079 31.6721 68.3257 15.6209 8.9172 29.3035 15.7601 37.9020 12.3737 3.5860 15.0449 86.8635 336.7726 4.1023 108.3093 131.9911 7.9343 3.9567 9.2794 4.9903 10.3678 3.1479 14.2299 3.9283 5.8361 1.7813 23.4776 60.4713
temp: 298.150 k
press: 1.00000 atm
elementType: 8 8 8 7 7 6 6 6 6 6 6 6 6 6 6 6 6 1 1 1 1 1 1 1 1 1 1 1 1
symmnumber: 1
zpe: 581250.7 jmol-1
zpe.correction: 0.221387 hartree
zpe.thermalcorrener: 0.237120 hartree
zpe.thermalcorrenthalpy: 0.238064 hartree
zpe.thermalcorrgfe: 0.175734 hartree
zpe.sumelectzpe: -798.431395 hartree
zpe.sumelectthermal: -798.415662 hartree
zpe.sumelectthermalent: -798.414718 hartree
zpe.sumelectthermalfe: -798.477047 hartree
dipole: -0.0347 -1.8272 2.2722
dipole: 2.9159
quadrupole: -87.6456 -110.8332 -99.3966
quadrupole: 5.1190 8.7866 -3.3993
quadrupole: 11.6462 -11.5414 -0.1048 5.1190 8.7866 -3.3993
hfenergy: -798.6527814 hartree
pointgroup: C01 [X(C12H12N2O3)]
dipole: 0.0186096 -0.5966454 -0.9796876 debye
polarizability: 212.9923043|-3.1129326|160.1243762|-14.7239|8.9930248|87.6016502 unknown
InChI: InChI=1S/C12H12N2O3/c1-8(15)6-7-14-12(17)10-5-3-2-4-9(10)11(16)13-14/h2-5,13H,6-7H2,1H3
charge 0 multiplicity 1
29 atoms
O  -0.430774 -2.094962 0.34405
O  1.640666 3.00739 0.194194
O  -4.857673 0.668618 0.692567
N  -0.641183 0.19991 0.563773
N  -0.086727 1.501461 0.477501
C  -2.097137 0.105395 0.777242
C  1.566652 -0.708553 0.058945
C  -2.877082 -0.024583 -0.548821
C  0.12226 -0.94604 0.326569
C  2.111173 0.606879 -0.005831
C  1.251599 1.798392 0.217747
C  2.410212 -1.828019 -0.14979
C  3.489152 0.792051 -0.275862
C  -4.388498 0.136081 -0.349397
C  3.779165 -1.637572 -0.416077
C  4.319963 -0.325758 -0.47992
C  -5.280342 -0.376313 -1.46919
H  -2.445817 0.985978 1.345143
H  -2.276187 -0.786388 1.398958
H  -2.552745 0.757927 -1.267236
H  -2.655707 -0.996533 -1.026916
H  -0.718086 2.273298 0.707476
H  1.964234 -2.826254 -0.097465
H  3.87473 1.815779 -0.316636
H  4.430416 -2.5037 -0.574747
H  5.385886 -0.184562 -0.688099
H  -5.312035 -1.483101 -1.432898
H  -6.304949 0.009298 -1.35325
H  -4.879267 -0.099819 -2.461428
