program: Gaussian 09
title: 000242224
version: EM64L-G09RevD.01
frameworkgroup: C1[X(C4H6N2O)]
method: RPBEPBE
basis: SDD
operation: Freq
keyword: #pfreq=noraman
keyword: PBEPBE/SDD
title: #p freq=noraman PBEPBE/SDD
converged: YES YES NO NO
title: Mulliken charges:
elementType: O N N C C C C H H H H H H
charge: -0.422633 -0.084729 -0.066512 -0.302099 -0.138332 -0.306951 -0.280609 0.237398 0.227854 0.267729 0.254348 0.257057 0.357479
chargesum: 0.00000
title: Mulliken charges with hydrogens summed into heavy atoms:
elementType: O N N C C C C
charge: -0.065154 -0.084729 -0.066512 0.163152 0.129397 -0.052603 -0.023552
polarizability: 7.16897400e+01 -1.36407634e+00 5.92970286e+01 -5.26765194e+00 1.10599209e+00 3.46987718e+01
1716.lowfreq: -11.2818 -7.4314 0.0005 0.0008 0.0010 7.3504 67.4575 132.4038 320.6495
frequency: 67.4127 132.3963 320.6491 395.0864 441.8616 614.0023 640.4610 720.3262 754.4348 828.8377 882.5205 902.9084 913.4674 956.7532 976.6378 1045.2164 1073.2982 1141.4687 1194.9048 1264.2919 1311.3223 1334.7072 1378.2916 1401.1187 1419.7224 1450.6809 1495.4498 3030.0453 3120.7042 3222.4396 3230.6214 3256.0414 3566.3090
redmass: 3.3099 5.4234 1.8832 2.1502 2.0188 3.0527 5.2953 4.4603 1.2878 1.2827 1.3884 5.5730 3.1855 3.4253 2.1382 1.2940 1.9828 1.4216 1.7515 2.9245 2.1308 1.3923 2.5048 1.4595 2.4714 1.1597 4.0316 1.0615 1.1047 1.0916 1.0969 1.1104 1.0661
irintensity: 8.6909 1.1826 45.2553 48.7782 120.5883 12.1360 2.2667 66.1823 94.2097 9.3494 1.6685 3.8417 61.6073 124.8975 14.9298 19.7489 28.2622 14.0599 14.3713 74.4041 5.9685 0.8220 65.0307 13.8915 6.1689 9.8459 23.5431 41.6063 10.6567 2.4496 1.5538 2.1699 12.6864
temp: 298.150 k
press: 1.00000 atm
elementType: 8 7 7 6 6 6 6 1 1 1 1 1 1
symmnumber: 1
zpe: 266075.7 jmol-1
zpe.correction: 0.101343 hartree
zpe.thermalcorrener: 0.107598 hartree
zpe.thermalcorrenthalpy: 0.108542 hartree
zpe.thermalcorrgfe: 0.070742 hartree
zpe.sumelectzpe: -340.182964 hartree
zpe.sumelectthermal: -340.176709 hartree
zpe.sumelectthermalent: -340.175765 hartree
zpe.sumelectthermalfe: -340.213565 hartree
dipole: 0.5493 0.7757 0.4084
dipole: 1.0345
quadrupole: -40.6086 -39.5572 -41.6385
quadrupole: 3.0506 -3.3274 2.9270
quadrupole: -0.0071 1.0442 -1.0371 3.0506 -3.3274 2.9270
hfenergy: -340.2843072 hartree
pointgroup: C01 [X(C4H6N2O1)]
dipole: 0.2381738 -0.2807305 -0.1735825 debye
dipolederiv: -0.9489697 0.1353679 0.0456465 0.1078198 -0.2250057 0.1034223 0.3429799 0.1214763 -0.6428677 -1.013771 -0.0197467 -0.0717396 -0.0134001 -0.0375331 0.018524 -0.3362783 0.0105762 -0.2610825 -0.0678063 0.1935564 0.0396477 0.3430068 -0.3226246 0.0765236 0.0924537 0.0352901 -0.1871992 1.4174219 -0.0271755 -0.0990834 -0.0373961 0.3127027 -0.0138488 -0.1586485 -0.0348274 0.7193736 0.3663218 -0.0058132 0.1274648 -0.2330379 -0.0539213 -0.0512618 0.1550191 -0.0059353 -0.1079697 -0.2259894 -0.087504 0.0228612 -0.1850107 -0.1400443 -0.0216304 -0.0088207 -0.0153258 -0.2272745 -0.0967098 -0.0189275 0.0460544 0.140071 0.2914508 0.0466375 0.0300173 0.0250103 -0.1095015 0.0014997 -0.0120101 0.0355247 0.0550983 -0.045962 0.1423407 0.0319669 0.0630568 -0.0152993 0.0057899 0.0027635 0.0031332 -0.0487184 -0.0091939 -0.1342869 0.0155904 -0.0564745 0.0073273 0.1063073 -0.0511895 -0.0437208 -0.0314887 0.0111748 -0.0240678 -0.0393343 -0.0283577 0.2068136 0.0133583 0.0806572 -0.052341 0.0843678 0.0712143 0.0138932 -0.0574551 0.0097977 0.1964122 0.0438052 -0.0619323 -0.047038 -0.0753136 0.0283057 -0.0343788 -0.0520126 -0.0288359 0.1666774 0.3987422 -0.1280461 -0.0064098 -0.1059982 0.1194367 -0.1218669 -0.0154779 -0.0954508 0.2545904 unknown
polarizability: 70.7099229|1.0037588|58.9150254|7.7480426|3.7353872|36.0605921 unknown
InChI: InChI=1S/C4H6N2O/c7-4-6-3-1-2-5-6/h1-3,7H,4H2
charge 0 multiplicity 1
13 atoms
O  -2.627362 -0.262418 0.426304
N  -0.332534 -0.106335 -0.38398
N  0.291204 1.109844 -0.078877
C  -1.753551 -0.087915 -0.725152
C  0.511743 -1.189084 -0.190872
C  1.741229 -0.672166 0.239039
C  1.552913 0.746639 0.294204
H  -1.937669 0.87041 -1.243471
H  -1.983048 -0.940279 -1.381534
H  0.185742 -2.212805 -0.360554
H  2.642269 -1.233714 0.472298
H  2.26803 1.517183 0.576694
H  -2.529367 0.517639 1.029702
