program: Gaussian 09
title: 000242219
version: EM64L-G09RevD.01
frameworkgroup: C1[X(C15H13NO)]
method: RPBEPBE
basis: SDD
operation: Freq
keyword: #p
keyword: freq=noraman
keyword: PBEPBE/SDD
title: #p freq=noraman PBEPBE/SDD
converged: YES YES NO NO
title: Mulliken charges:
elementType: O N C C C C C C C C C C C C C C C H H H H H H H H H H H H H
charge: -0.262219 -0.239896 -0.620862 0.342060 0.242936 0.205917 0.298476 -0.432647 -0.377539 -0.382550 -0.324447 0.203203 -0.237472 -0.246596 -0.245128 -0.262674 -0.818402 0.251395 0.255533 0.233356 0.234986 0.286323 0.228484 0.230702 0.229361 0.229533 0.228081 0.271703 0.241556 0.236826
chargesum: 0.00000
title: Mulliken charges with hydrogens summed into heavy atoms:
elementType: O N C C C C C C C C C C C C C C C
charge: -0.262219 -0.239896 -0.113933 0.342060 0.242936 0.205917 0.298476 -0.199291 -0.142552 -0.154066 -0.038124 0.203203 -0.006770 -0.017235 -0.015595 -0.034593 -0.068318
polarizability: 2.30282095e+02 1.48633906e+01 2.03012275e+02 3.83305245e+00 -8.35710783e+00 8.72828118e+01
1716.lowfreq: -7.2276 -5.9320 -0.0002 0.0005 0.0006 5.1715 50.0918 70.4431 81.4474
frequency: 50.0828 70.4399 81.4428 111.9954 159.3769 207.1926 210.3769 250.7592 287.9097 339.8354 349.4221 370.5095 399.6840 416.5691 457.6735 473.3952 508.8317 541.2980 563.1955 577.0286 586.1196 614.9768 640.4889 695.5641 733.0589 736.9464 746.1359 763.3621 779.5523 826.6375 863.3853 869.6997 886.8898 944.1030 945.3591 969.3658 981.9698 987.2128 996.6510 1016.0169 1028.8754 1043.3776 1049.0944 1093.5479 1115.1349 1135.0271 1175.4617 1179.2706 1207.2168 1209.2256 1227.3515 1273.3972 1288.0778 1305.7119 1331.2563 1358.6737 1376.8280 1379.2953 1388.6301 1438.2977 1444.0470 1450.7417 1464.0357 1477.9789 1486.5641 1497.5557 1571.4737 1589.5335 1595.7045 1612.8724 1619.1375 2946.3047 2987.8467 3075.3032 3115.5936 3119.1333 3129.2037 3129.3528 3132.5193 3142.3993 3148.4202 3162.5969 3165.0055 3204.6998
redmass: 4.7054 4.1473 4.1469 4.1886 3.7452 1.1748 3.6982 4.9133 3.4058 2.7610 4.0145 4.8703 4.9683 3.6557 3.2014 4.3895 3.5839 4.1232 3.2109 4.6160 3.7664 6.8003 4.8403 4.6425 3.4281 2.1836 3.1717 1.4938 1.8396 4.1800 1.5988 1.6223 2.5890 1.4790 1.3927 1.7378 1.3303 1.3299 7.1352 1.9832 1.6908 2.1996 2.0104 2.3792 3.9732 1.4633 1.0604 1.0790 1.4412 2.3661 2.2911 2.1918 1.4440 2.0413 1.5116 2.8776 2.1278 3.1165 2.9648 2.4904 2.3549 1.1052 1.1832 1.7714 1.2180 2.9936 6.0641 6.9522 7.4247 6.5665 6.9784 1.0718 1.0383 1.0987 1.0893 1.0876 1.0866 1.0969 1.0871 1.0916 1.0930 1.0990 1.1001 1.0946
irintensity: 0.4517 4.7636 1.4994 1.0340 6.3460 0.6714 1.1899 1.1465 1.3809 2.8083 0.4889 2.9192 1.2399 2.5648 0.1625 8.2340 3.5965 4.8559 0.1742 0.7166 2.7981 7.1204 12.6280 2.6684 2.0259 57.8302 0.3112 97.8909 14.6200 0.8261 1.1233 2.2068 0.3108 1.6672 2.8511 33.7821 0.1296 0.1379 3.1414 4.9037 6.0359 4.4215 8.0937 14.3574 12.8043 3.5116 0.4839 1.9027 114.4237 13.5236 24.8728 42.3273 7.8159 2.2402 53.2957 132.7631 7.6921 54.6161 56.9127 40.0889 17.4361 26.4455 23.3366 28.6653 27.6505 17.3284 0.6793 181.6740 9.2009 32.9900 16.6407 36.7543 7.7178 13.7941 4.3405 15.0009 5.3309 6.9420 5.7513 16.7440 16.4254 38.6710 27.2535 2.0918
temp: 298.150 k
press: 1.00000 atm
elementType: 8 7 6 6 6 6 6 6 6 6 6 6 6 6 6 6 6 1 1 1 1 1 1 1 1 1 1 1 1 1
symmnumber: 1
zpe: 627335.4 jmol-1
zpe.correction: 0.238939 hartree
zpe.thermalcorrener: 0.252429 hartree
zpe.thermalcorrenthalpy: 0.253373 hartree
zpe.thermalcorrgfe: 0.198785 hartree
zpe.sumelectzpe: -708.216615 hartree
zpe.sumelectthermal: -708.203125 hartree
zpe.sumelectthermalent: -708.202181 hartree
zpe.sumelectthermalfe: -708.256769 hartree
dipole: -3.1903 -0.5904 2.0655
dipole: 3.8461
quadrupole: -98.9738 -82.9451 -104.3879
quadrupole: 5.1144 7.3311 -5.9810
quadrupole: -3.5382 12.4905 -8.9523 5.1144 7.3311 -5.9810
hfenergy: -708.455554 hartree
pointgroup: C01 [X(C15H13N1O1)]
dipole: -1.2478948 0.3436397 -0.7838423 debye
polarizability: 226.612655|-17.6964716|205.9705953|-8.3262641|-9.6934794|87.9939315 unknown
InChI: InChI=1S/C15H13NO/c1-11(17)16-10-12-6-2-3-7-13(12)14-8-4-5-9-15(14)16/h2-9H,10H2,1H3
charge 0 multiplicity 1
30 atoms
O  3.109386 1.416592 0.809996
N  1.135562 0.97596 -0.371734
C  -0.067094 1.453327 -1.103936
C  -1.333269 0.901016 -0.471884
C  -1.293482 -0.447995 -0.017393
C  -0.014171 -1.188668 -0.133792
C  1.214311 -0.459514 -0.256373
C  -2.514258 1.663537 -0.361052
C  -2.46813 -1.006291 0.552719
C  0.044964 -2.606285 -0.082076
C  2.453078 -1.145782 -0.280242
C  2.092924 1.84457 0.186582
C  -3.683551 1.090037 0.189193
C  -3.654089 -0.248281 0.646937
C  2.480606 -2.553465 -0.207808
C  1.275481 -3.289233 -0.117385
C  1.864952 3.347624 0.013987
H  0.009852 1.10746 -2.157151
H  -0.086904 2.551169 -1.119053
H  -2.5262 2.703149 -0.710896
H  -2.451687 -2.027345 0.948104
H  3.380894 -0.576432 -0.341393
H  -0.886953 -3.179083 -0.025832
H  -4.602224 1.681074 0.269523
H  -4.551261 -0.694845 1.089526
H  3.443856 -3.074335 -0.233523
H  1.297336 -4.383497 -0.079202
H  2.70366 3.855706 0.511893
H  0.922658 3.68367 0.483858
H  1.851554 3.651361 -1.048795
