program: Gaussian 09
title: 000242208
version: EM64L-G09RevD.01
frameworkgroup: C1[X(C14H28N2)]
method: RPBEPBE
basis: SDD
operation: Freq
keyword: #pfreq=noraman
keyword: PBEPBE/SDD
title: #p freq=noraman PBEPBE/SDD
converged: YES YES NO NO
title: Mulliken charges:
elementType: N N C C C C C C C C C C C C C C H H H H H H H H H H H H H H H H H H H H H H H H H H H H
charge: -0.103956 -0.024581 -0.373564 -0.358615 -0.359836 -0.379086 -0.359080 -0.358962 -0.363238 -0.340028 -0.338765 -0.382010 -0.444181 -0.695016 -0.695491 -0.142327 0.201730 0.186717 0.199139 0.182030 0.200730 0.179538 0.210446 0.193323 0.186819 0.206530 0.183880 0.207981 0.223526 0.186222 0.191377 0.191838 0.191504 0.191496 0.217404 0.217342 0.244763 0.251750 0.209417 0.215310 0.211625 0.208741 0.215444 0.212112
chargesum: 0.00000
title: Mulliken charges with hydrogens summed into heavy atoms:
elementType: N N C C C C C C C C C C C C C C
charge: -0.103956 -0.024581 0.014883 0.022554 0.020432 0.024683 0.034270 0.032899 0.046510 0.043187 0.044236 0.052736 0.052332 -0.058663 -0.059194 -0.142327
polarizability: 1.81229009e+02 -2.27866158e+00 1.66727956e+02 5.35490645e+00 -4.64944630e+00 1.44523108e+02
1716.lowfreq: -7.5816 -5.8563 -0.0007 -0.0004 -0.0003 8.5911 13.6455 28.6740 33.7355
frequency: 12.0101 28.5283 33.5652 38.0607 45.8663 56.3156 63.4689 90.0331 100.8938 112.5014 114.1988 132.5503 154.8732 178.4941 191.5818 224.9184 226.8302 230.8728 261.5683 275.9499 297.6284 333.9966 369.1167 384.2454 412.6915 451.9940 500.8328 509.7406 572.6339 729.6277 730.5268 732.3630 769.0877 789.1720 792.4391 820.7545 840.5816 854.9499 897.7352 898.5228 924.6124 926.6489 933.5473 992.9289 1007.4405 1022.5442 1047.8934 1058.6293 1067.0808 1073.7456 1081.3966 1085.0307 1088.9386 1104.2131 1112.4306 1118.8314 1148.6687 1189.1027 1199.2487 1201.0243 1227.6505 1235.2771 1254.3301 1259.6584 1267.5673 1269.3684 1280.7215 1282.7535 1285.6362 1289.2675 1300.4483 1302.2248 1314.7506 1323.5016 1343.4021 1344.8158 1358.0133 1369.1961 1369.6843 1380.8248 1389.8063 1390.7085 1445.5639 1462.1972 1463.1614 1464.1123 1465.9681 1470.3237 1471.1345 1474.2950 1476.7569 1476.9475 1479.1234 1481.0654 1485.9068 1488.3917 1489.7381 2195.3358 2838.4565 2841.4296 2856.0130 2957.6911 2961.8350 2961.9048 2971.7764 2971.9729 2974.4493 2975.5789 2978.4748 2986.1094 2992.0603 3003.2557 3003.4444 3003.6654 3015.8330 3017.9491 3019.7451 3039.3287 3043.8096 3046.7275 3047.6964 3058.6987 3068.5967 3068.8969 3070.8160 3070.9649
redmass: 5.3970 3.8044 3.4122 3.4623 1.5942 2.6811 2.0416 2.9505 1.7631 2.5610 2.3485 3.0630 2.7209 2.3555 2.5297 1.2130 1.1681 2.9896 2.4823 2.6641 2.6485 3.3369 3.2181 3.2164 3.0546 2.9854 3.0701 3.2885 3.2030 1.0828 1.1005 1.0763 1.3470 1.2396 1.1838 3.1040 2.2497 1.9921 1.7336 1.7386 1.2586 1.2417 1.5118 3.2359 3.0387 3.1782 2.8584 3.2567 2.3864 2.3787 2.2865 2.2437 2.3573 2.0055 2.2792 1.7391 1.5654 1.9786 1.2959 1.7382 1.3960 1.4528 1.3117 1.2612 1.3190 1.3223 1.0758 1.0878 1.0833 1.1463 1.2130 1.2718 1.2778 1.3627 1.5152 1.5214 1.5361 1.3912 1.3987 1.4215 1.2164 1.2407 1.0869 1.0797 1.0669 1.0684 1.0756 1.0692 1.0740 1.0931 1.0426 1.0434 1.0730 1.0662 1.0919 1.0882 1.0896 12.4202 1.0713 1.0713 1.0707 1.0600 1.0587 1.0587 1.0372 1.0390 1.0588 1.0601 1.0600 1.0595 1.0609 1.0972 1.0976 1.0967 1.0868 1.0896 1.0895 1.1013 1.1015 1.1011 1.1010 1.1036 1.1005 1.1005 1.0995 1.0995
irintensity: 3.7074 3.0015 0.8310 0.1352 0.1346 1.9406 0.8583 0.7581 0.6576 0.2055 0.2021 1.2799 0.7113 0.1368 0.6558 0.3426 0.1326 1.5622 0.1609 0.5330 1.2110 2.0855 0.2372 0.9347 1.2630 4.9820 4.7428 6.5792 1.0697 8.7554 7.6846 8.5742 0.5247 0.1153 0.0258 7.7560 0.1414 10.3823 15.5426 5.2009 7.0689 2.4397 2.2933 0.4312 2.3861 2.6124 6.2734 2.4844 11.9137 6.7668 8.8543 27.7989 22.6872 3.1468 1.1150 9.5534 7.0211 10.0263 7.3400 6.7522 2.2420 6.5194 2.7087 2.0264 2.9680 2.7013 0.2096 0.1458 0.1240 0.1987 16.3107 12.8340 3.1871 0.4950 0.6296 0.8113 3.7966 13.4304 11.9723 3.2897 6.4710 9.7232 18.5077 1.9942 0.0977 1.0618 0.1234 0.6545 0.4228 0.4161 12.4572 11.6897 6.8571 3.4532 19.3533 13.7644 10.5358 10.8550 40.6335 39.9506 195.0117 13.9831 7.8124 41.6763 38.5981 24.5448 55.5040 20.6644 48.9224 46.1062 18.2932 9.8665 8.7620 0.2493 7.0699 11.5486 8.3557 8.0645 50.3654 61.7033 25.1024 90.0874 63.5201 126.9406 45.2979 66.5556
temp: 298.150 k
press: 1.00000 atm
elementType: 7 7 6 6 6 6 6 6 6 6 6 6 6 6 6 6 1 1 1 1 1 1 1 1 1 1 1 1 1 1 1 1 1 1 1 1 1 1 1 1 1 1 1 1
symmnumber: 1
zpe: 1038493.1 jmol-1
zpe.correction: 0.395541 hartree
zpe.thermalcorrener: 0.416659 hartree
zpe.thermalcorrenthalpy: 0.417603 hartree
zpe.thermalcorrgfe: 0.341296 hartree
zpe.sumelectzpe: -658.436220 hartree
zpe.sumelectthermal: -658.415102 hartree
zpe.sumelectthermalent: -658.414158 hartree
zpe.sumelectthermalfe: -658.490465 hartree
dipole: 1.9374 -1.3189 2.5848
dipole: 3.4891
quadrupole: -119.8431 -100.5565 -106.2581
quadrupole: 8.0474 -22.0509 1.1720
quadrupole: -10.9572 8.3294 2.6278 8.0474 -22.0509 1.1720
hfenergy: -658.831761 hartree
pointgroup: C01 [X(C14H28N2)]
dipole: -0.7676897 -0.5312703 -1.0063753 debye
polarizability: 181.2886265|2.6543797|166.7949462|4.6443084|4.8147177|144.3965015 unknown
InChI: InChI=1S/C14H28N2/c1-3-5-12-16(13-6-4-2)14-10-8-7-9-11-15/h3-10,12-14H2,1-2H3
charge 0 multiplicity 1
44 atoms
N  -1.235049 -0.013733 0.214114
N  6.014501 0.607201 1.335524
C  0.143998 -0.492415 0.491294
C  -1.454507 1.395987 0.637994
C  -2.280736 -0.93472 0.73403
C  1.171143 0.01106 -0.545611
C  -2.514486 2.125329 -0.214503
C  -2.504798 -2.174173 -0.158356
C  2.611248 -0.447105 -0.224511
C  -2.7936 3.562067 0.28338
C  -3.575354 -3.129415 0.416839
C  3.634287 0.057107 -1.264675
C  5.095106 -0.386564 -0.96381
C  -3.837804 4.301684 -0.580467
C  -3.815853 -4.366507 -0.475139
C  5.609741 0.156373 0.307023
H  0.13687 -1.598552 0.466699
H  0.482458 -0.202986 1.520028
H  -0.49592 1.940428 0.542896
H  -1.7411 1.456438 1.719852
H  -3.232939 -0.373851 0.791058
H  -2.04997 -1.266457 1.7800
H  0.862837 -0.35219 -1.545337
H  1.1442 1.118463 -0.592724
H  -3.462297 1.549826 -0.212288
H  -2.166709 2.146319 -1.265713
H  -1.553595 -2.730241 -0.285583
H  -2.802555 -1.830019 -1.167942
H  2.901391 -0.083439 0.782132
H  2.647976 -1.556039 -0.18026
H  -1.845832 4.138995 0.292702
H  -3.143053 3.52391 1.33579
H  -4.52822 -2.575836 0.545929
H  -3.268172 -3.458017 1.431143
H  3.367313 -0.326369 -2.268904
H  3.595176 1.161915 -1.322611
H  5.15103 -1.491738 -0.918997
H  5.769999 -0.061304 -1.77858
H  -4.802716 3.760109 -0.585371
H  -4.025801 5.323842 -0.203305
H  -3.496567 4.385362 -1.629535
H  -2.887643 -4.957521 -0.591971
H  -4.587882 -5.031882 -0.046592
H  -4.150418 -4.066743 -1.486143
