program: Gaussian 09
title: 000242180
version: EM64L-G09RevD.01
frameworkgroup: C1[X(C15H10N2O5)]
method: RPBEPBE
basis: SDD
operation: Freq
keyword: #p
keyword: freq=noraman
keyword: PBEPBE/SDD
title: #p freq=noraman PBEPBE/SDD
converged: YES YES NO NO
title: Mulliken charges:
elementType: O O O O O N N C C C C C C C C C C C C C C C H H H H H H H H H H
charge: -0.252614 -0.169040 -0.176108 -0.179555 -0.177928 -0.364887 -0.352725 0.426583 0.547386 -0.485862 0.197021 -0.390861 -0.330324 0.176441 0.143157 0.157573 0.154679 -0.248059 -0.245788 -0.255579 -0.252266 -0.532738 0.287625 0.270847 0.246046 0.273463 0.274118 0.278021 0.278280 0.230500 0.223833 0.248762
chargesum: 0.00000
title: Mulliken charges with hydrogens summed into heavy atoms:
elementType: O O O O O N N C C C C C C C C C C C C C C C
charge: -0.252614 -0.169040 -0.176108 -0.179555 -0.177928 -0.364887 -0.352725 0.426583 0.547386 -0.198237 0.197021 -0.120014 -0.084278 0.176441 0.143157 0.157573 0.154679 0.025404 0.028330 0.022442 0.026014 0.170356
polarizability: 2.46305544e+02 -1.57147096e+00 1.92081397e+02 1.68876253e+01 2.61322621e+00 1.33238582e+02
1716.lowfreq: -6.2635 -4.3248 -0.0008 -0.0007 -0.0004 3.8503 25.5034 29.2996 52.9481
frequency: 25.4857 29.2943 52.9448 59.1057 80.0875 91.9240 112.4240 133.1148 138.0351 173.5444 202.5997 225.1500 231.4483 271.8322 282.7833 288.6980 293.0986 315.7617 365.0897 396.3268 424.9152 440.1985 462.0029 533.6446 545.1886 580.1394 588.2891 603.0687 613.0056 630.0586 637.5156 652.9864 683.5294 688.2516 702.0054 733.7490 734.0725 740.4961 797.0082 808.3314 824.0011 824.9680 887.6581 929.3125 936.9134 941.7466 942.2304 986.8828 990.2124 1001.6922 1015.3595 1054.4268 1061.6728 1095.3435 1104.2473 1113.6791 1143.6185 1152.9742 1180.9583 1212.5070 1245.8781 1281.1248 1286.0626 1286.9053 1337.0816 1367.0090 1388.4370 1436.6085 1449.6557 1468.2152 1470.9176 1507.6523 1585.8697 1588.7868 1591.0707 1621.1830 1623.9703 1632.1458 1674.7818 1683.4995 2969.2022 3062.0666 3133.8401 3166.2155 3191.8510 3197.2684 3203.3961 3207.2694 3232.1002 3235.6370
redmass: 10.7161 8.8742 4.3614 5.7056 5.6505 4.7576 5.7548 6.6876 8.0687 3.6023 7.1828 7.1288 1.3307 5.6966 4.2399 4.3676 6.8771 8.1837 5.3210 5.7646 8.4218 8.8785 3.5417 4.2664 4.2473 4.3908 7.4412 3.5116 7.1844 2.6596 3.1507 5.1737 8.0408 7.3391 6.0975 7.0980 6.4580 3.6450 7.0534 1.5372 1.9821 2.0420 1.5914 8.1975 1.3834 1.3115 1.3132 8.4049 3.4664 4.7175 3.3234 1.3042 1.2974 5.0483 5.4014 1.2579 1.9696 1.5173 1.6466 2.7920 3.6797 1.4750 1.7120 1.7136 5.9914 4.4938 10.5892 1.2721 4.1404 1.0555 1.0669 2.9517 6.9768 8.2814 7.0004 11.4511 6.9032 11.0472 11.4944 11.5291 1.0326 1.1044 1.1001 1.0886 1.0954 1.0936 1.0894 1.0894 1.1106 1.1110
irintensity: 0.1223 0.2310 7.0003 2.4227 1.5679 3.0219 6.4092 5.9413 3.9398 1.0612 3.2240 4.9020 0.2030 0.8097 0.0758 0.3236 2.3660 1.7009 0.1721 1.1671 28.4182 3.9571 2.9153 1.3018 1.7616 6.0883 32.5887 1.9742 10.2988 4.9387 1.5460 7.4927 53.8513 23.4495 3.3678 1.3878 1.6013 9.2358 0.9024 19.2153 97.3520 63.8559 7.0640 10.4295 1.9416 0.0814 0.0901 52.0177 26.7393 0.6406 7.4943 17.4076 49.0162 42.2277 79.4524 0.1872 87.1327 5.5528 30.1001 9.1847 200.6069 16.1912 1.1085 1.9132 449.4304 26.4485 59.6097 30.0467 72.2878 28.0488 55.4797 323.0529 8.3635 4.0806 12.9564 418.6442 59.9346 352.4663 3.0065 2.5294 64.6515 34.5890 17.8342 8.2509 0.7391 0.8680 0.0110 0.0165 1.7275 0.7630
temp: 298.150 k
press: 1.00000 atm
elementType: 8 8 8 8 8 7 7 6 6 6 6 6 6 6 6 6 6 6 6 6 6 6 1 1 1 1 1 1 1 1 1 1
symmnumber: 1
zpe: 585532.0 jmol-1
zpe.correction: 0.223017 hartree
zpe.thermalcorrener: 0.241793 hartree
zpe.thermalcorrenthalpy: 0.242737 hartree
zpe.thermalcorrgfe: 0.174417 hartree
zpe.sumelectzpe: -1061.667955 hartree
zpe.sumelectthermal: -1061.649179 hartree
zpe.sumelectthermalent: -1061.648235 hartree
zpe.sumelectthermalfe: -1061.716555 hartree
dipole: 0.0857 1.0754 -0.1515
dipole: 1.0894
quadrupole: -91.9971 -110.2099 -141.6357
quadrupole: -6.3665 -7.4556 -2.5304
quadrupole: 22.6171 4.4043 -27.0215 -6.3665 -7.4556 -2.5304
hfenergy: -1061.8909719 hartree
pointgroup: C01 [X(C15H10N2O5)]
dipole: 0.0412142 -0.3793935 0.1950801 debye
polarizability: 241.5044245|-7.6770473|187.4311431|-27.3713132|-15.3572287|142.6899556 unknown
InChI: InChI=1S/C15H10N2O5/c1-22-11-3-2-9(16-12(18)4-5-13(16)19)8-10(11)17-14(20)6-7-15(17)21/h2-8H,1H3
charge 0 multiplicity 1
32 atoms
O  -2.548256 -1.801711 0.83128
O  -3.05237 0.914245 2.139564
O  -1.970219 1.077336 -2.445133
O  3.778333 -1.960188 -0.850128
O  2.43004 2.411081 0.317855
N  -2.183254 0.749502 -0.084643
N  2.698823 0.076175 -0.174319
C  -1.03968 -0.076455 0.157781
C  1.379265 -0.412546 0.122015
C  0.249788 0.402808 -0.127131
C  -1.226503 -1.396007 0.662877
C  1.203736 -1.704604 0.668956
C  -0.090417 -2.194874 0.931557
C  -3.127796 1.151714 0.913788
C  -2.58324 1.244617 -1.365301
C  3.794911 -0.724048 -0.640748
C  3.127344 1.441317 -0.062781
C  -4.187447 1.936677 0.184812
C  -3.868268 1.9965 -1.135691
C  4.958214 0.212963 -0.824491
C  4.570523 1.470821 -0.488481
C  -2.788015 -3.106711 1.455959
H  0.36523 1.412452 -0.524833
H  2.070792 -2.337729 0.868051
H  -0.20241 -3.20429 1.335846
H  -5.03792 2.370584 0.710951
H  -4.395828 2.486205 -1.9544
H  5.924918 -0.145191 -1.178063
H  5.141296 2.399232 -0.494725
H  -2.345007 -3.147833 2.468724
H  -2.386067 -3.928003 0.832156
H  -3.881815 -3.192236 1.523995
