program: Gaussian 09
title: 000242177
version: EM64L-G09RevD.01
frameworkgroup: C1[X(C14H16ClN3)]
method: RPBEPBE
basis: SDD
operation: Freq
keyword: #p
keyword: freq=noraman
keyword: PBEPBE/SDD
title: #p freq=noraman PBEPBE/SDD
converged: YES YES NO NO
title: Mulliken charges:
elementType: Cl N N N C C C C C C C C C C C C C C H H H H H H H H H H H H H H H H
charge: -0.044419 -0.134352 -0.079378 0.107157 -0.410371 -0.405076 -0.362288 -0.396101 -0.403884 -0.398376 0.345599 -0.427900 0.087094 0.057356 -0.342118 -0.317651 -0.212871 -0.229146 0.210386 0.194167 0.204499 0.207545 0.208478 0.198949 0.207762 0.231878 0.261425 0.206250 0.212331 0.241228 0.255811 0.260284 0.231393 0.234340
chargesum: 0.00000
title: Mulliken charges with hydrogens summed into heavy atoms:
elementType: Cl N N N C C C C C C C C C C C C C C
charge: -0.044419 -0.134352 -0.079378 0.107157 -0.005819 0.006968 0.045140 0.043538 0.063791 0.055183 0.345599 -0.427900 0.087094 0.057356 -0.086306 -0.057367 0.018523 0.005194
polarizability: 3.17243851e+02 2.21591066e+01 1.83905034e+02 8.75847841e-01 -5.36131532e-01 9.61218434e+01
1716.lowfreq: -16.7256 -10.1495 -2.0948 -0.0026 -0.0026 -0.0016 23.7542 50.9561 61.3825
frequency: 22.7732 50.9306 61.1597 94.6433 117.0924 122.6030 185.6400 217.1806 227.8027 255.6077 266.5350 301.6283 331.3683 347.8403 363.4819 384.9044 425.6841 461.1660 487.6940 507.9700 538.9861 556.8671 559.3722 574.4451 595.1670 645.1340 702.0284 738.7796 747.0855 769.7993 771.5126 780.0018 842.1727 851.7484 872.8034 877.6097 895.2337 933.1517 959.0699 961.4711 975.6315 990.4697 1010.2772 1014.1733 1044.2014 1068.1363 1098.2498 1107.7393 1143.4664 1154.7891 1160.9873 1184.0051 1203.8281 1204.9700 1227.3702 1253.1198 1262.1150 1277.6840 1289.4512 1301.1266 1324.0856 1330.9738 1340.9010 1344.1916 1356.3882 1361.4488 1363.9253 1390.2021 1434.7270 1453.0524 1461.2884 1464.8131 1467.3743 1474.9349 1477.5088 1482.8567 1490.1493 1533.6540 1554.1619 1612.9562 2935.2922 2958.4194 2964.1359 2974.9368 2981.0595 2999.7319 3014.8770 3032.5877 3040.3873 3063.1485 3088.5484 3098.1513 3134.3360 3149.9183 3164.9925 3174.5677
redmass: 3.6974 4.3612 4.3793 3.6944 3.2219 2.7102 4.7108 5.1717 3.4612 5.7068 3.1577 4.0274 6.2963 3.4149 2.7917 3.3787 2.1470 4.4805 4.6530 2.0263 3.2736 4.3235 7.1394 5.2083 9.2646 3.5170 7.4864 2.4295 1.5449 1.5339 2.8830 4.5183 3.4419 2.9094 1.5121 1.6965 3.7304 2.2891 2.3974 1.3639 2.4195 1.3171 2.0964 1.9660 2.8474 2.2583 2.0283 1.9058 2.4199 1.7825 1.5782 1.3009 1.3382 2.1086 1.2552 1.6466 1.4145 1.1649 1.5044 2.7125 4.1317 1.3711 1.3200 1.5082 1.3753 1.3645 1.4731 3.5209 3.0054 1.0894 1.0869 3.4050 1.3427 1.4145 1.1174 1.6276 1.1502 5.6863 7.2032 6.6750 1.0714 1.0707 1.0626 1.0629 1.0632 1.0640 1.0970 1.1003 1.1009 1.1005 1.0897 1.0905 1.0860 1.0896 1.0955 1.1003
irintensity: 0.4270 0.9200 0.4030 1.0540 1.4170 1.9117 0.0207 1.5695 1.6829 3.6173 3.5044 4.1828 6.9811 0.3123 1.6046 3.6800 5.6341 10.3956 0.8749 0.6473 13.7076 9.8382 1.9305 12.6603 6.4084 5.4458 2.8257 4.2656 10.3224 81.1394 16.6857 7.6614 28.4298 27.6212 0.2468 1.7310 11.4258 25.1904 30.5074 2.7054 20.2563 0.0437 7.6848 41.3877 39.5420 3.8654 1.4833 6.2999 12.3531 6.6629 19.5063 19.5446 21.4992 4.2236 26.4314 88.8426 17.2651 4.7947 69.3371 9.8204 48.3136 11.5062 13.0026 7.1151 1.7476 3.9911 14.5133 10.6938 112.8728 9.2145 8.0159 25.5647 124.1789 70.9689 11.0288 66.8479 15.4243 187.9780 65.1276 5.0272 44.9799 37.7911 43.3252 63.8919 26.7759 38.1190 29.1389 72.9500 44.0780 59.7875 11.0099 8.6780 3.8332 8.0934 15.1500 27.5288
temp: 298.150 k
press: 1.00000 atm
elementType: 17 7 7 7 6 6 6 6 6 6 6 6 6 6 6 6 6 6 1 1 1 1 1 1 1 1 1 1 1 1 1 1 1 1
symmnumber: 1
zpe: 722978.8 jmol-1
zpe.correction: 0.275368 hartree
zpe.thermalcorrener: 0.290906 hartree
zpe.thermalcorrenthalpy: 0.291851 hartree
zpe.thermalcorrgfe: 0.231517 hartree
zpe.sumelectzpe: -1166.082919 hartree
zpe.sumelectthermal: -1166.067380 hartree
zpe.sumelectthermalent: -1166.066436 hartree
zpe.sumelectthermalfe: -1166.126770 hartree
dipole: 1.4895 -2.5637 0.7173
dipole: 3.0506
quadrupole: -94.0201 -115.7682 -114.8125
quadrupole: 1.8418 0.9763 2.1069
quadrupole: 14.1802 -7.5679 -6.6122 1.8418 0.9763 2.1069
hfenergy: -1166.3582866 hartree
pointgroup: C01 [X(C14H16Cl1N3)]
dipole: 0.5927258 -1.0185144 0.2274561 debye
polarizability: 316.6925496|23.2823563|184.073087|5.3895583|5.2799715|96.5050911 unknown
InChI: InChI=1S/C14H16ClN3/c15-13-14(18-9-5-1-2-6-10-18)17-12-8-4-3-7-11(12)16-13/h3-4,7-8H,1-2,5-6,9-10H2
charge 0 multiplicity 1
34 atoms
Cl 0.713667 2.953346 -0.171643
N  1.53641 -0.190971 0.215425
N  -0.696775 -0.919383 -0.006447
N  -1.661466 1.725729 0.090519
C  4.564232 -1.301888 0.049234
C  4.903661 0.21148 0.128241
C  3.33408 -1.662276 -0.822085
C  3.684277 1.169591 0.244965
C  1.969407 -1.575669 -0.097785
C  2.477088 0.616394 1.040133
C  0.18393 0.109185 0.117843
C  -0.378583 1.466642 0.081659
C  -2.054887 -0.672918 -0.057602
C  -2.570322 0.673112 0.065043
C  -2.980919 -1.753582 -0.186808
C  -3.972002 0.915533 0.090225
C  -4.357287 -1.497359 -0.160752
C  -4.85771 -0.164253 -0.017028
H  5.456383 -1.833986 -0.335243
H  4.393807 -1.702915 1.069823
H  5.580606 0.366366 0.992041
H  5.4835 0.501547 -0.770211
H  3.310592 -1.042581 -1.739552
H  3.432572 -2.714814 -1.155294
H  4.017108 2.111059 0.723322
H  3.313668 1.452224 -0.756514
H  1.177549 -2.029531 -0.713088
H  2.019621 -2.16991 0.841958
H  2.828199 -0.028579 1.873745
H  1.918674 1.44665 1.49598
H  -2.584773 -2.768859 -0.284663
H  -4.322324 1.947954 0.184117
H  -5.065442 -2.328821 -0.248981
H  -5.938841 0.008682 0.001724
