program: Gaussian 09
title: 000242129
version: EM64L-G09RevD.01
frameworkgroup: C1[X(C21H34O3)]
method: RPBEPBE
basis: SDD
operation: Freq
keyword: #pfreq=noraman
keyword: PBEPBE/SDD
title: #p freq=noraman PBEPBE/SDD
converged: YES YES NO NO
title: Mulliken charges:
elementType: O O O C C C C C C C C C C C C C C C C C C C C C H H H H H H H H H H H H H H H H H H H H H H H H H H H H H H H H H H
charge: -0.301131 -0.455661 -0.277075 -0.117582 0.410065 -0.187396 -0.083691 0.266724 -0.524099 -0.548444 -0.252280 -0.566365 -0.076708 -0.497783 0.488904 -0.837643 -0.513969 -0.485708 -0.835817 -0.687570 -0.474901 0.039797 -0.524522 -0.514161 0.194428 0.254123 0.189909 0.187254 0.219096 0.228558 0.213563 0.215191 0.246707 0.220149 0.195840 0.222097 0.209232 0.242502 0.219639 0.247858 0.203257 0.214642 0.211582 0.221165 0.228626 0.227332 0.233748 0.226675 0.216884 0.207191 0.186463 0.361451 0.212068 0.228075 0.239129 0.233059 0.195472 0.204051
chargesum: 0.00000
title: Mulliken charges with hydrogens summed into heavy atoms:
elementType: O O O C C C C C C C C C C C C C C C C C C C C C
charge: -0.301131 -0.094210 -0.277075 0.076847 0.410065 0.066728 0.106217 0.266724 -0.117749 -0.106322 -0.037088 -0.099508 0.119131 -0.066454 0.488904 -0.127643 -0.096070 -0.274126 -0.158695 -0.227147 -0.050827 0.226260 0.154751 0.118420
polarizability: 2.94846642e+02 -4.63621327e+00 2.11288834e+02 2.09041370e+00 -3.73458893e+00 1.77433059e+02
1716.lowfreq: -17.1324 -3.6564 -0.0010 -0.0005 0.0006 6.1754 29.0285 42.3860 52.2014
frequency: 27.9931 42.1061 52.1666 63.1459 75.6542 93.8847 106.0604 120.7383 159.9057 166.2308 179.5148 183.1540 198.6297 208.8606 212.2040 226.5086 240.0763 259.8831 266.2845 283.5666 288.3074 290.3330 304.4429 310.1557 332.4933 350.6044 368.8712 397.1019 398.4609 400.1858 427.9187 448.7955 460.7514 477.5858 492.9849 507.3370 519.1505 540.8061 569.0097 588.7315 608.8959 615.9752 664.0107 696.7279 723.9030 783.9037 793.8197 801.1279 819.0202 827.0863 834.5625 844.2193 877.3784 892.4089 907.9453 917.6457 927.7525 937.3592 953.4469 959.6110 978.9692 989.5886 997.2112 1012.4838 1018.2793 1023.6156 1025.9249 1030.0194 1043.0544 1049.9993 1058.9711 1074.7894 1078.3724 1101.6607 1113.2635 1115.8690 1116.4702 1121.9053 1126.8951 1132.9532 1138.9051 1144.2408 1154.4441 1154.5406 1160.8651 1172.1472 1182.0617 1195.1333 1205.5056 1215.3974 1229.5977 1236.5387 1248.0674 1256.0791 1266.5436 1276.3523 1280.4927 1283.1843 1293.6186 1299.5221 1311.6995 1316.8550 1320.7290 1326.3908 1329.9874 1333.4984 1338.0090 1342.6265 1344.6953 1347.2356 1352.7762 1363.5607 1366.6497 1376.4325 1388.1237 1395.4082 1434.4289 1434.4639 1455.9078 1458.0136 1459.4497 1460.3553 1460.5167 1462.1268 1468.3834 1469.5451 1472.5258 1475.0949 1477.5434 1480.9746 1487.6651 1494.9886 1502.8535 1684.2369 2891.1477 2905.8100 2917.5786 2923.4162 2927.2281 2945.9486 2949.5596 2952.7736 2960.9059 2971.5440 2974.9446 2982.7823 2983.6981 2986.6587 2991.1023 2996.1619 2999.4958 3004.5408 3012.2464 3021.5549 3032.0479 3036.0282 3044.5872 3046.4808 3050.9363 3073.3723 3074.6220 3080.8861 3083.3362 3089.1097 3093.1940 3094.8936 3107.2000 3405.6383
redmass: 4.1562 3.3810 2.8282 3.1763 4.0561 3.0786 3.3064 2.7446 1.7361 1.8629 2.2639 2.1732 2.4283 1.3661 1.2601 2.2779 2.0956 2.4012 2.3959 3.1919 2.1543 2.4829 3.1649 2.6869 2.9311 2.3848 2.7707 3.2370 2.8876 3.0605 3.2856 3.0937 2.6820 3.0686 2.9153 3.4753 2.1840 1.3339 3.7027 2.8279 2.9561 3.0441 2.5890 3.3434 3.0477 3.3840 1.9810 2.0753 2.2872 1.9140 2.2836 2.2390 1.7995 1.8939 2.6187 2.1329 3.2133 1.7128 2.2164 1.9895 2.0634 2.1905 2.2351 2.5000 2.1032 2.2508 2.6865 1.8240 3.9253 5.0202 2.2947 2.4724 2.5776 1.6815 1.3494 1.6082 1.3502 1.9015 1.6339 2.1221 2.1029 1.3683 1.5768 1.6900 1.7184 1.8063 1.5477 2.4416 1.5910 1.5241 1.8455 1.4791 1.4485 1.3392 1.4646 1.3447 1.4730 1.4069 1.3559 1.4984 1.3390 1.2848 1.3533 1.3788 1.5566 1.3190 1.4369 1.4712 1.5536 1.4023 1.4185 1.4921 1.4643 1.4156 1.2257 1.2148 1.1353 1.1434 1.0811 1.0766 1.0886 1.0549 1.0628 1.0814 1.0847 1.0805 1.0739 1.0553 1.0549 1.0670 1.0660 1.0554 1.0572 7.8322 1.0808 1.0827 1.0807 1.0672 1.0354 1.0732 1.0386 1.0669 1.0630 1.0637 1.0820 1.0400 1.0860 1.0592 1.0562 1.0459 1.0857 1.0998 1.0619 1.0957 1.0959 1.1039 1.1013 1.1005 1.0973 1.1034 1.0985 1.0977 1.0903 1.0989 1.0989 1.0974 1.0999 1.0647
irintensity: 0.0204 0.2155 2.9290 2.8542 4.8607 3.1765 4.5579 1.0195 1.5394 0.9251 0.5195 4.3375 0.1486 0.8733 0.5208 1.3718 0.1290 1.6251 4.8685 3.0130 0.9880 3.4872 7.8073 1.2157 1.9207 2.2441 1.3885 2.9358 0.4996 12.4854 6.1659 10.3061 1.0128 4.1153 3.0969 5.5569 8.9867 55.9593 4.8532 4.0357 4.2724 12.6799 1.4222 0.8866 8.1618 1.4519 1.5217 3.0598 32.4238 8.3768 2.2817 6.8954 3.8328 3.2166 6.1654 7.0724 7.7882 4.9234 2.1314 2.6123 12.3321 2.4168 5.8270 31.0161 15.2186 20.8597 27.1410 6.4952 207.3114 86.1158 7.6008 4.3911 13.5923 0.3094 0.3126 1.7227 3.0465 6.9555 2.2206 3.7453 6.9258 3.8684 18.5492 19.2800 0.4348 6.4888 8.7216 3.9386 13.2606 7.7284 0.4923 1.2372 3.2480 0.9453 1.4889 2.6225 3.2886 1.5358 1.5880 0.5109 0.2420 7.9995 2.5295 8.6699 2.2488 3.2066 0.8077 1.8480 12.2566 25.8698 6.3780 18.8493 34.9259 3.4212 11.9758 32.3724 2.5241 9.3888 16.2528 0.4884 7.2903 10.4123 7.5895 4.0590 13.7184 2.9605 8.1809 10.4091 3.1882 34.6010 3.9187 4.1384 9.8698 2.6614 13.8704 33.4745 13.9304 44.5201 88.7869 28.7433 22.7827 75.3843 30.5940 20.6025 17.3785 24.1622 94.7492 31.8199 14.5178 20.3522 44.5177 74.7563 30.6110 27.4998 55.2846 46.1102 52.9809 36.5989 42.3589 37.2733 30.7299 39.0571 53.8719 23.1558 16.0945 38.0083 26.2989 41.8550
temp: 298.150 k
press: 1.00000 atm
elementType: 8 8 8 6 6 6 6 6 6 6 6 6 6 6 6 6 6 6 6 6 6 6 6 6 1 1 1 1 1 1 1 1 1 1 1 1 1 1 1 1 1 1 1 1 1 1 1 1 1 1 1 1 1 1 1 1 1 1
symmnumber: 1
zpe: 1342426.0 jmol-1
zpe.correction: 0.511303 hartree
zpe.thermalcorrener: 0.535603 hartree
zpe.thermalcorrenthalpy: 0.536547 hartree
zpe.thermalcorrgfe: 0.459178 hartree
zpe.sumelectzpe: -1044.357728 hartree
zpe.sumelectthermal: -1044.333428 hartree
zpe.sumelectthermalent: -1044.332484 hartree
zpe.sumelectthermalfe: -1044.409853 hartree
dipole: -0.0888 -2.8182 -3.3915
dipole: 4.4105
quadrupole: -149.2743 -149.8779 -144.7041
quadrupole: 3.8359 4.0108 -1.1651
quadrupole: -1.3222 -1.9258 3.2480 3.8359 4.0108 -1.1651
hfenergy: -1044.8690312 hartree
pointgroup: C01 [X(C21H34O3)]
dipole: -0.0680496 1.1098343 1.3321636 debye
polarizability: 294.6220714|6.4996151|211.522492|-1.2613588|-3.792079|177.4239718 unknown
InChI: InChI=1S/C21H34O3/c1-20-9-7-14(23-3)11-13(20)5-6-15-16(20)8-10-21(2)17(15)12-18(22)19(21)24-4/h5,14-19,22H,6-12H2,1-4H3
charge 0 multiplicity 1
58 atoms
O  -5.086641 1.015124 -0.006379
O  -5.171482 -1.569775 -0.709442
O  6.182613 -0.132294 0.028598
C  -1.861686 -0.777901 0.372923
C  -2.636191 0.484268 -0.11972
C  -0.428655 -0.884664 -0.18313
C  0.372607 0.401238 0.203038
C  1.837979 0.389372 -0.381938
C  -1.867695 1.729863 0.378895
C  -0.4000 1.713114 -0.128559
C  -3.994194 0.223178 0.580672
C  -2.853298 -1.952289 0.155057
C  -4.25803 -1.32842 0.416524
C  0.283981 -2.13729 0.378225
C  2.495182 -0.986725 -0.150604
C  -2.833469 0.528884 -1.658222
C  2.684911 1.467313 0.379602
C  1.785637 -2.092667 0.202935
C  1.846625 0.701352 -1.911575
C  4.003942 -1.07178 -0.353588
C  4.2001 1.414861 0.076791
C  4.767713 0.022076 0.415281
C  -6.21841 1.210609 0.912982
C  7.108745 0.628685 0.864069
H  -1.748574 -0.651695 1.477244
H  -0.470861 -0.972728 -1.288206
H  0.483081 0.360405 1.312389
H  -1.872226 1.738266 1.490184
H  -2.36685 2.660522 0.044628
H  -0.403561 1.878961 -1.221505
H  0.135225 2.576383 0.311257
H  -3.899182 0.470642 1.660863
H  -2.83175 -2.320554 -0.886712
H  -2.647533 -2.810552 0.817846
H  -4.729975 -1.747972 1.326872
H  -0.119412 -3.049838 -0.105177
H  0.041523 -2.243195 1.460124
H  -3.499679 1.369674 -1.919052
H  -1.877102 0.672246 -2.187815
H  -3.297315 -0.396877 -2.03874
H  2.534364 1.322699 1.470228
H  2.303113 2.47656 0.134757
H  2.32951 -3.034271 0.372923
H  1.604106 1.761431 -2.10931
H  2.835663 0.502163 -2.358737
H  1.113871 0.071819 -2.447428
H  4.377775 -2.064912 -0.046853
H  4.268665 -0.951105 -1.424325
H  4.396398 1.623698 -0.992604
H  4.715645 2.201195 0.661379
H  4.670458 -0.153184 1.513656
H  -5.519183 -0.669931 -0.97284
H  -5.892488 1.751645 1.823592
H  -6.680803 0.246299 1.203669
H  -6.953254 1.820478 0.364371
H  8.120522 0.31498 0.560328
H  6.962538 0.400727 1.9424
H  7.010606 1.72389 0.71506
