program: Gaussian 09
title: 000242128
version: EM64L-G09RevD.01
frameworkgroup: C1[X(C21H28F2O2)]
method: RPBEPBE
basis: SDD
operation: Freq
keyword: #p
keyword: freq=noraman
keyword: PBEPBE/SDD
title: #p freq=noraman PBEPBE/SDD
converged: YES YES NO NO
title: Mulliken charges:
elementType: F F O O C C C C C C C C C C C C C C C C C C C C C H H H H H H H H H H H H H H H H H H H H H H H H H H H H
charge: -0.203176 -0.168920 -0.217425 -0.149014 0.403065 -0.121871 -0.194755 -0.085991 0.255683 -0.231214 -0.531687 -0.546534 -0.543183 -0.465844 -0.507339 -0.842488 0.324003 -0.503967 -0.374686 -0.809450 0.150447 0.054858 -0.560692 0.140435 -0.768357 0.203192 0.254511 0.200081 0.243013 0.187131 0.249844 0.229658 0.214072 0.211731 0.238499 0.223286 0.211624 0.233121 0.226271 0.221230 0.219330 0.265154 0.228742 0.239144 0.252233 0.253913 0.227802 0.220621 0.255165 0.258602 0.238510 0.235939 0.255687
chargesum: 0.00000
title: Mulliken charges with hydrogens summed into heavy atoms:
elementType: F F O O C C C C C C C C C C C C C C C C C C C C C
charge: -0.203176 -0.168920 -0.217425 -0.149014 0.403065 0.081321 0.059756 0.114090 0.255683 0.011799 -0.094712 -0.102805 -0.092953 -0.030934 -0.047947 -0.136773 0.324003 -0.036081 -0.122453 -0.107114 0.150447 0.054858 -0.046926 0.140435 -0.038222
polarizability: 2.78786511e+02 -1.23022589e+01 2.13462235e+02 -3.66332672e+00 -5.97399565e+00 1.69302332e+02
1716.lowfreq: -0.0006 0.0001 0.0004 3.0474 7.3866 13.2108 31.9251 43.8102 49.7074
frequency: 31.8686 43.7488 49.7043 66.2644 84.2570 93.4454 114.3483 126.8770 138.8006 162.6381 169.9539 194.7234 198.0484 209.2805 228.6054 241.6242 245.8690 257.7896 280.1781 284.6835 290.5015 301.2229 310.5300 316.9624 332.1948 337.1835 361.7807 391.5582 428.5806 433.1982 442.4658 462.1479 475.8555 483.0403 512.0489 529.4952 545.1017 559.6901 584.7979 589.0813 629.3552 639.7369 658.5948 693.4166 710.5850 712.1776 790.8300 797.0425 822.0641 836.1510 838.7875 848.9563 871.5919 885.6550 899.8196 909.4620 923.8878 937.6165 946.8755 954.2773 968.8682 975.9283 987.9069 998.1222 1005.3612 1009.4328 1022.9942 1027.1435 1042.7777 1045.0948 1057.0435 1079.0213 1087.9304 1097.4311 1119.7452 1132.4400 1138.2197 1141.8536 1144.5434 1158.9503 1172.4088 1188.5867 1197.1675 1198.0688 1206.2549 1211.7243 1223.3763 1230.0656 1247.5501 1249.1997 1262.6711 1265.4463 1272.1974 1289.2978 1296.4189 1299.1383 1311.0662 1316.3586 1327.2343 1331.6085 1337.4816 1343.2606 1344.4438 1352.7713 1355.5625 1365.7434 1370.6680 1391.3240 1394.2418 1440.8451 1444.5069 1445.4292 1453.1763 1461.7130 1464.2805 1469.9967 1474.8105 1480.4374 1484.0661 1491.4919 1497.6027 1499.3721 1618.1484 1657.9182 1667.6163 2899.3766 2911.3350 2919.9732 2934.1293 2955.5760 2976.5778 2979.9915 2981.9371 2990.6369 2992.6569 2994.4848 2997.5362 3005.5019 3007.3874 3008.4798 3043.1113 3045.5858 3052.5998 3055.3121 3064.3718 3070.9255 3080.8438 3085.0097 3086.8406 3099.7783 3103.9455 3119.5592 3131.5329
redmass: 4.7061 5.1256 4.7226 4.3808 4.9359 4.0175 1.1357 1.8634 3.2232 4.4105 3.5369 2.6236 2.9480 1.9214 1.9946 2.3843 2.1046 2.3948 2.9764 2.8758 3.3934 2.3401 4.0875 3.7803 3.2383 3.1319 3.0403 3.1648 3.1089 3.8499 3.4232 5.3475 4.3433 3.6983 3.1904 3.1980 3.0069 3.2710 3.3230 4.1570 4.8225 2.6509 3.5905 2.9235 2.7642 3.3457 2.2990 2.8200 1.8640 1.8110 1.9855 2.2128 2.3891 2.9469 2.1162 1.9021 1.8863 2.4290 1.8594 2.8714 1.9058 2.0060 2.1992 1.9733 2.2064 2.1302 2.1537 1.9450 2.1710 2.2321 2.5943 2.3968 1.9600 2.0913 1.9456 2.2220 2.0424 1.7516 2.1825 2.1218 1.8660 2.1327 2.5004 1.8532 1.9044 1.3318 2.1829 1.8912 1.3126 1.3829 1.6412 1.5544 1.6338 1.4845 1.2884 1.4514 1.4932 1.4179 1.6393 1.4283 1.4483 1.5528 1.4180 1.3898 1.4749 1.2454 1.5251 1.2043 1.2014 1.0765 1.0916 1.0903 1.0541 1.0747 1.0758 1.0819 1.0799 1.0552 1.0893 1.0579 1.0623 1.0581 8.1758 9.4817 8.8334 1.0808 1.0799 1.0814 1.0671 1.0662 1.0818 1.0372 1.0625 1.0589 1.0447 1.0384 1.0549 1.0851 1.0613 1.0667 1.0951 1.1025 1.0988 1.0995 1.0961 1.1032 1.0967 1.0988 1.1007 1.0988 1.0974 1.1005 1.0903
irintensity: 0.6375 5.2671 2.1944 0.2564 2.3150 1.5654 0.0452 0.7335 0.8376 2.3120 1.6407 0.4879 0.9139 1.1012 0.1347 4.2724 1.7972 1.6803 1.1314 0.6363 0.7826 0.4921 1.8904 0.1722 4.1106 1.5805 0.5742 0.2520 0.6430 0.5233 0.8152 2.9010 1.6205 1.2790 2.1677 2.6559 3.3197 7.7415 5.7121 7.6794 8.6552 9.2840 5.7726 1.3834 1.3330 8.7091 3.4976 17.1814 13.8397 8.0251 30.0381 41.2947 24.7268 57.1931 8.2106 20.2171 3.1442 8.8608 9.9889 1.8077 8.0438 9.6699 7.3936 7.9139 16.1370 1.5193 8.5116 7.7057 5.1755 16.5573 33.4169 4.6671 6.8392 1.1714 9.6891 11.6706 10.7791 5.4666 0.3148 24.9049 8.2318 29.4627 22.3103 41.0131 4.3004 10.2739 5.6511 12.3386 15.3701 1.0697 4.0318 22.4369 1.3813 17.6984 7.5051 11.5055 3.7502 8.1264 1.2516 2.1341 5.8319 5.0572 3.2406 0.0981 1.1143 62.2793 12.8313 7.5340 41.3791 23.6818 26.9195 15.6642 22.3722 6.0131 1.2795 10.1168 5.8066 18.3715 3.5221 0.2420 10.8560 12.5922 97.7522 73.0929 145.5740 8.6445 19.2037 19.4813 20.1318 38.8192 14.4964 2.6141 26.0492 25.8654 23.6771 13.0517 38.3816 15.9545 10.2770 66.8774 17.8586 4.5248 50.2456 18.4712 5.1015 71.0951 25.6155 33.7398 10.5903 16.7721 13.5150 17.0903 4.9122
temp: 298.150 k
press: 1.00000 atm
elementType: 9 9 8 8 6 6 6 6 6 6 6 6 6 6 6 6 6 6 6 6 6 6 6 6 6 1 1 1 1 1 1 1 1 1 1 1 1 1 1 1 1 1 1 1 1 1 1 1 1 1 1 1 1
symmnumber: 1
zpe: 1169084.0 jmol-1
zpe.correction: 0.445281 hartree
zpe.thermalcorrener: 0.469209 hartree
zpe.thermalcorrenthalpy: 0.470153 hartree
zpe.thermalcorrgfe: 0.393490 hartree
zpe.sumelectzpe: -1165.245774 hartree
zpe.sumelectthermal: -1165.221845 hartree
zpe.sumelectthermalent: -1165.220901 hartree
zpe.sumelectthermalfe: -1165.297564 hartree
dipole: -5.6958 0.9104 -0.7437
dipole: 5.8159
quadrupole: -184.1536 -147.8029 -151.3614
quadrupole: -25.9016 10.5078 0.0450
quadrupole: -23.0476 13.3031 9.7446 -25.9016 10.5078 0.0450
hfenergy: -1165.6910542 hartree
pointgroup: C01 [X(C21H28F2O2)]
dipole: -2.2410414 0.3720527 -0.2736455 debye
polarizability: 278.5115793|-12.9001982|213.5210551|-4.6878231|-6.2851969|169.5184438 unknown
InChI: InChI=1S/C21H28F2O2/c1-12(24)14-5-6-15-13-4-7-17-20(3,11-9-18(25)21(17,22)23)16(13)8-10-19(14,15)2/h7,13-16H,4-6,8-11H2,1-3H3
charge 0 multiplicity 1
53 atoms
F  4.51604 0.274906 1.480656
F  4.683484 1.766643 -0.247808
O  -5.270098 -1.757781 0.27372
O  5.536291 -0.449188 -1.599625
C  -2.70319 -0.255801 0.125368
C  -1.802899 0.959928 -0.257811
C  -0.350706 0.84662 0.241308
C  0.287538 -0.474299 -0.301469
C  1.757741 -0.687795 0.236101
C  -4.053749 0.230891 -0.487069
C  -2.092983 -1.516631 -0.529542
C  -0.622348 -1.718391 -0.076481
C  -2.644678 2.199072 0.144684
C  -4.130544 1.756152 -0.099499
C  0.481896 2.064781 -0.221047
C  -2.843163 -0.440028 1.662288
C  2.549649 0.627557 0.057207
C  2.435951 -1.809825 -0.624153
C  1.969721 1.839892 -0.158998
C  1.764776 -1.102901 1.741128
C  -5.314298 -0.587692 -0.196912
C  4.057662 0.540019 0.099906
C  3.973252 -1.947027 -0.424503
C  4.648187 -0.627544 -0.738887
C  -6.65042 0.059433 -0.552829
H  -1.745218 0.955324 -1.372739
H  -0.344952 0.826009 1.350133
H  0.377967 -0.333545 -1.404181
H  -3.945525 0.182448 -1.597125
H  -2.127747 -1.403109 -1.634482
H  -2.690378 -2.411356 -0.276088
H  -0.619353 -1.997463 0.992957
H  -0.204277 -2.584677 -0.623646
H  -2.381068 3.096402 -0.442809
H  -2.483928 2.448869 1.210415
H  -4.733642 1.896636 0.816211
H  -4.611619 2.350765 -0.89593
H  0.225092 2.959375 0.38098
H  0.208991 2.33019 -1.267554
H  -1.866839 -0.605389 2.148006
H  -3.302929 0.441372 2.145434
H  -3.482082 -1.313497 1.873447
H  2.238425 -1.608099 -1.696184
H  1.971708 -2.78351 -0.385287
H  2.616067 2.712719 -0.3145
H  2.784422 -1.096198 2.157725
H  1.166644 -0.399388 2.346449
H  1.347007 -2.116671 1.87329
H  4.387975 -2.728299 -1.083162
H  4.190888 -2.223212 0.624696
H  -6.895081 0.847317 0.185683
H  -6.607186 0.550547 -1.542367
H  -7.449771 -0.697754 -0.540005
