program: Gaussian 09
title: 000242073
version: EM64L-G09RevD.01
frameworkgroup: C1[X(C8H10BrN3S)]
method: RPBEPBE
basis: SDD
operation: Freq
keyword: #p
keyword: freq=noraman
keyword: PBEPBE/SDD
title: #p freq=noraman PBEPBE/SDD
converged: NO YES NO NO
title: Mulliken charges:
elementType: Br S N N N C C C C C C C C H H H H H H H H H H
charge: 0.004668 0.267502 -0.126875 0.023941 0.005652 -0.401174 -0.412677 0.269207 -0.411153 0.268876 -0.440274 -0.778737 -0.825866 0.245548 0.253153 0.250542 0.254243 0.252356 0.261088 0.247631 0.269226 0.279947 0.243178
chargesum: 0.00000
title: Mulliken charges with hydrogens summed into heavy atoms:
elementType: Br S N N N C C C C C C C C
charge: 0.004668 0.267502 -0.126875 0.023941 0.005652 0.097527 0.092107 0.269207 -0.411153 0.268876 -0.440274 -0.017662 -0.033515
polarizability: 2.16059379e+02 -1.30865889e+00 1.62592695e+02 -7.14992418e-01 -4.28714067e+00 7.02838736e+01
1716.lowfreq: -3.4632 -0.0013 -0.0010 -0.0005 3.1271 6.6189 44.4146 77.4849 84.7709
frequency: 44.4093 77.4836 84.7671 109.6029 125.5584 129.9276 137.3908 142.5302 199.0948 201.6716 244.0060 249.8535 272.0621 304.2152 370.4689 422.4071 483.8785 540.0896 570.6246 595.6434 656.7413 662.6487 759.5842 777.1881 796.8773 877.7366 916.9573 946.2768 970.0239 977.3470 993.9225 999.7601 1027.2550 1044.7631 1091.5393 1104.0717 1119.4065 1139.2620 1209.9486 1242.7033 1264.8130 1322.3158 1345.3383 1394.7871 1430.1444 1435.2879 1449.4429 1455.5176 1462.1224 1462.4334 1475.8318 1485.4652 1517.2294 2991.5477 3022.7323 3069.7064 3081.5105 3088.9444 3128.1390 3146.4508 3153.8479 3186.9296 3202.7168
redmass: 5.0344 3.5853 3.0513 2.3859 1.4186 2.6341 3.2174 1.2617 4.2200 4.6978 5.7328 7.5088 3.7510 8.1496 4.5518 6.7438 6.6746 5.3385 4.2946 6.6686 10.7536 7.2683 7.7827 6.0165 1.0641 7.8602 5.8760 4.1219 3.4564 1.1800 1.2845 1.1583 1.8933 1.5689 1.2796 1.3441 1.5512 1.4462 5.2783 6.6778 7.8454 4.6682 1.2663 1.2597 1.9959 1.0555 1.4889 1.9279 1.0751 1.0631 1.4510 1.7439 9.4790 1.0381 1.0281 1.0965 1.0486 1.0605 1.0991 1.1041 1.1055 1.1187 1.1175
irintensity: 0.1803 3.4948 3.4901 3.8806 1.4488 0.9418 1.1458 0.3982 2.8673 3.3539 6.9974 4.3873 2.8144 4.3458 2.4227 3.5287 14.1766 10.4530 1.3234 10.1435 4.2108 1.0023 11.5433 2.6984 25.9550 8.4584 42.1137 15.6314 32.2256 8.5251 8.1080 1.0949 23.7115 5.8376 5.0790 4.2130 42.4967 0.8564 111.7696 260.9139 14.9822 12.6675 6.4983 29.5114 225.9182 15.6219 52.2225 15.0100 4.6689 21.7846 69.0192 26.6900 586.8643 6.8681 23.0348 10.6693 14.2809 33.2916 7.7458 12.8195 12.5395 0.8575 22.0692
temp: 298.150 k
press: 1.00000 atm
elementType: 35 16 7 7 7 6 6 6 6 6 6 6 6 1 1 1 1 1 1 1 1 1 1
symmnumber: 1
zpe: 443772.4 jmol-1
zpe.correction: 0.169024 hartree
zpe.thermalcorrener: 0.183129 hartree
zpe.thermalcorrenthalpy: 0.184073 hartree
zpe.thermalcorrgfe: 0.126669 hartree
zpe.sumelectzpe: -885.606018 hartree
zpe.sumelectthermal: -885.591913 hartree
zpe.sumelectthermalent: -885.590969 hartree
zpe.sumelectthermalfe: -885.648373 hartree
dipole: -1.1074 3.4206 1.2041
dipole: 3.7917
quadrupole: -90.9979 -84.6537 -94.6772
quadrupole: 7.8139 -2.3182 2.2447
quadrupole: -0.8883 5.4559 -4.5676 7.8139 -2.3182 2.2447
hfenergy: -885.7750421 hartree
pointgroup: C01 [X(C8H10Br1N3S1)]
dipole: -0.1617049 -1.4208242 -0.4248305 debye
dipolederiv: -0.7745354 -0.1283748 0.0473607 -0.1997988 -0.0710208 0.0174829 0.0504654 0.0116466 -0.0170341 -0.769689 -0.0922391 -0.0083061 -0.2203074 0.0459411 -0.0310055 0.0179993 -0.0088977 -0.0715314 -0.1584669 -0.346121 0.1100369 -0.2164132 -1.7927435 -0.0890999 0.1460735 0.3993744 -0.4290379 -0.9794919 -0.4907407 0.0170754 -0.5088142 -0.9546284 0.0337746 0.036651 0.067822 -0.1616772 -1.4230975 -0.1393019 -0.0120583 0.2741541 -0.566406 0.0434436 -0.0608433 0.0649006 -0.1938339 0.0416128 -0.0308678 -0.0194321 -0.0452644 0.3597978 -0.0473095 -0.0365691 -0.063815 0.2269436 0.1331276 0.2066994 -0.0783582 0.1426725 0.4404482 0.0328746 -0.0512656 -0.027006 0.2447014 0.3239514 0.207973 -0.0094549 0.0996387 1.8531036 -0.0946851 -0.0513734 -0.4264806 0.1894968 0.8798658 0.4705518 -0.1381277 0.2628929 -0.903809 0.018591 -0.0806162 0.111742 -0.1443885 0.5770709 -0.0454502 0.0425039 -0.0286561 0.8880119 -0.0906527 0.0208803 -0.116473 0.0984948 1.9620733 0.3744862 0.0000624 0.3371858 0.533957 -0.0418873 -0.0029908 -0.0909397 0.0181468 -0.1868518 0.2269535 -0.0279287 0.1566606 -0.0990868 0.0120166 -0.0174861 0.0063276 0.0254269 0.1191682 -0.0941128 0.0173912 -0.0932034 0.0438296 0.0088634 0.0194594 0.0077913 0.0434239 0.0509857 0.115793 -0.0148865 0.0501242 -0.0099793 0.0701597 -0.0306247 0.1133221 0.0229 -0.0026777 0.0500212 0.0847184 -0.0130783 0.0411945 0.0673981 0.0780188 -0.0352152 0.0164708 0.0541888 -0.0196789 -0.0330679 -0.02111 0.0106495 0.0763036 -0.0612369 -0.0481486 -0.0711669 -0.0316734 -0.1544641 0.0099238 -0.0613623 0.0560506 0.0216333 0.0378662 0.0375186 0.0455028 0.0405226 0.0388834 0.0824388 0.0168215 0.0693848 0.0241094 0.0918187 -0.0179314 -0.0277152 0.0781106 -0.1311285 0.0226452 -0.037209 -0.0342634 0.025898 0.0050588 0.0303498 0.1151376 0.0321753 0.0093513 -0.0937005 -0.0157859 0.0555978 -0.0551938 -0.0980238 -0.0072853 -0.0107356 0.0905457 -0.0029425 -0.0433925 0.084934 -0.0475829 -0.0909331 -0.0389854 -0.071871 -0.0171378 0.091184 0.0009117 0.0586882 0.0731209 -0.0000058 0.0882896 0.0368432 0.0621795 -0.0305267 -0.148099 -0.0262025 -0.0141317 -0.0372021 0.0815598 -0.0000715 -0.0111194 0.0010891 0.1281399 unknown
polarizability: 213.4199804|11.6561128|164.8620215|-0.1126185|-7.3403|70.6539464 unknown
InChI: InChI=1S/C8H10BrN3S/c1-5-6(9)7(12-3-4-12)11-8(10-5)13-2/h3-4H2,1-2H3
charge 0 multiplicity 1
23 atoms
Br -3.153643 -0.178865 0.163387
S  3.064941 1.595077 -0.116076
N  -0.521848 -1.991541 0.438945
N  1.075757 -0.28726 0.100356
N  0.424653 2.038251 -0.210547
C  0.274765 -3.137726 -0.051354
C  -1.199566 -2.978202 -0.448893
C  -0.245214 -0.656085 0.164634
C  -1.26825 0.330899 0.032532
C  -0.902684 1.685718 -0.165415
C  1.336373 1.034632 -0.064206
C  -1.907032 2.79757 -0.328958
C  3.968579 -0.033867 0.145298
H  0.551404 -3.87718 0.706109
H  1.040615 -2.926271 -0.806313
H  -1.416397 -2.669513 -1.478418
H  -1.966559 -3.594288 0.028892
H  -2.543944 2.893739 0.569652
H  -1.369953 3.742816 -0.495474
H  -2.584325 2.603587 -1.180637
H  3.770728 -0.712244 -0.696269
H  3.635867 -0.496302 1.084798
H  5.036634 0.230156 0.193159
