program: Gaussian 09
title: 000242071
version: EM64L-G09RevD.01
frameworkgroup: C1[X(C7H11BrN2O2)]
method: RPBEPBE
basis: SDD
operation: Freq
keyword: #p
keyword: freq=noraman
keyword: PBEPBE/SDD
title: #p freq=noraman PBEPBE/SDD
converged: NO YES NO NO
title: Mulliken charges:
elementType: Br O O N N C C C C C C C H H H H H H H H H H H
charge: 0.040304 -0.264805 -0.198993 -0.114156 -0.385400 -0.361463 -0.336817 -0.566106 -0.347215 0.241158 0.207440 -0.675930 0.264528 0.251114 0.257933 0.216659 0.326842 0.198495 0.229301 0.362282 0.222158 0.208156 0.224512
chargesum: 0.00000
title: Mulliken charges with hydrogens summed into heavy atoms:
elementType: Br O O N N C C C C C C C
charge: 0.040304 -0.264805 -0.198993 -0.114156 -0.023117 0.154179 0.137776 -0.239265 0.080581 0.241158 0.207440 -0.021103
polarizability: 1.30100545e+02 1.98086861e+00 1.07026140e+02 4.57214366e+00 1.62100344e+00 9.11540897e+01
1716.lowfreq: -14.5265 -10.7281 -0.0001 0.0005 0.0005 5.2264 27.9393 47.0802 60.3787
frequency: 27.2344 46.9374 60.3542 83.1511 130.5723 149.8546 180.2322 211.8418 267.2613 282.6598 321.3912 344.5483 379.8599 461.3561 506.1525 519.3393 590.8666 669.7611 700.7284 724.2389 744.7002 767.2395 779.2644 866.4657 879.2842 894.8645 969.0138 1008.4005 1048.4508 1088.4796 1110.0208 1147.5372 1169.3501 1210.6529 1227.2554 1261.7370 1268.0297 1283.6281 1298.8031 1313.3149 1348.6642 1361.7101 1371.8923 1394.8897 1416.3858 1454.7765 1468.2678 1474.8760 1477.9405 1486.9467 1636.5243 1658.9624 2930.1922 2978.4490 2979.9773 2991.0107 3036.4533 3071.3299 3072.1840 3082.5189 3085.0063 3123.4407 3525.5167
redmass: 3.7809 3.6720 10.0826 1.9354 7.5305 6.6802 8.3742 1.1282 2.7083 4.0034 3.6841 2.3155 8.4351 5.4606 6.8254 6.3095 5.2824 2.0984 8.3573 4.6773 1.1443 1.9701 4.0752 1.3168 2.5045 2.0100 2.1088 1.8362 3.0616 2.4432 2.1502 1.6449 1.4521 1.7145 2.8010 1.5847 1.4820 1.4969 1.3372 1.7224 1.9226 1.5263 1.5472 1.2073 2.1114 1.0779 1.1827 1.0572 1.0493 1.0806 10.0987 5.4252 1.0702 1.0432 1.0547 1.0661 1.0967 1.0975 1.0932 1.1000 1.1007 1.0881 1.0769
irintensity: 0.1722 0.8839 0.1395 0.2463 1.9587 2.6334 4.8502 0.1413 1.0130 3.8114 12.6171 3.2023 16.6778 15.2863 15.3733 18.7281 3.3410 29.5394 8.8538 3.5518 7.6048 107.0278 6.7111 3.2904 12.5625 6.7051 5.6021 4.7148 0.8855 18.0199 5.1741 32.7834 19.8234 78.8406 150.7107 38.9440 43.5305 61.9536 3.5433 27.7759 70.1052 6.8717 4.2395 9.8191 113.5617 13.4230 54.6201 10.8874 16.3909 17.3700 266.0070 448.5271 26.5612 41.4670 13.0736 40.0692 6.6172 28.3894 2.5835 38.3130 37.6707 1.4334 61.1595
temp: 298.150 k
press: 1.00000 atm
elementType: 35 8 8 7 7 6 6 6 6 6 6 6 1 1 1 1 1 1 1 1 1 1 1
symmnumber: 1
zpe: 475053.5 jmol-1
zpe.correction: 0.180938 hartree
zpe.thermalcorrener: 0.193524 hartree
zpe.thermalcorrenthalpy: 0.194468 hartree
zpe.thermalcorrgfe: 0.139479 hartree
zpe.sumelectzpe: -545.859251 hartree
zpe.sumelectthermal: -545.846665 hartree
zpe.sumelectthermalent: -545.845721 hartree
zpe.sumelectthermalfe: -545.900710 hartree
dipole: -3.2718 -2.6287 2.9174
dipole: 5.1114
quadrupole: -88.9726 -84.1596 -80.7822
quadrupole: 1.1035 -5.8665 0.7667
quadrupole: -4.3345 0.4785 3.8559 1.1035 -5.8665 0.7667
hfenergy: -546.0401895 hartree
pointgroup: C01 [X(C7H11Br1N2O2)]
dipole: 1.4131256 -1.1185239 -0.8921704 debye
dipolederiv: -0.1434761 -0.0010838 0.045834 -0.0526397 -0.2264847 0.1409533 0.1652436 0.1958787 -0.3818884 -0.7420309 -0.2610823 -0.1181905 -0.1128834 -1.0178609 -0.2274858 -0.1043845 -0.3127494 -0.4668604 -1.1869129 -0.0132761 -0.2683511 0.1042971 -0.52406 0.0833207 -0.2385838 -0.0414633 -0.3669823 -0.907592 0.1913012 0.0687614 0.3004635 -0.9606531 -0.1872465 -0.011495 -0.0787197 -0.3145651 -1.4687824 -0.1912799 -0.221255 -0.5472143 -0.5761672 -0.0565448 -0.3729486 -0.039354 -0.3965261 0.1058397 0.2261934 0.0642583 0.1469989 0.3080148 0.119413 0.2131064 0.1784863 0.1715937 0.6907899 -0.108571 -0.025201 -0.0938244 0.1667324 -0.0562974 0.0715235 -0.1475235 0.1744705 0.123572 0.1254703 -0.1952268 0.1505116 -0.0098496 -0.1325711 -0.2991619 -0.2824388 0.6353943 -0.0444733 0.040951 -0.003059 0.0468219 0.132978 0.0402386 0.0006333 0.0696662 0.0578272 1.7225452 0.0019654 0.2260646 -0.3710981 1.5679375 0.3467184 0.2532134 0.4366309 0.4465371 1.5347604 0.1045797 0.4289242 0.5043798 1.0284391 -0.0990603 0.4882251 0.1225171 0.1911638 -0.0554099 0.0212674 -0.0084132 -0.0011212 0.0942681 0.0043733 0.0542706 -0.0161228 0.0506926 0.0580288 0.0921871 -0.0160513 0.063583 -0.0474092 -0.012137 -0.055929 0.0253768 0.0948003 0.0136128 -0.0946648 0.0635662 -0.0398459 0.034522 0.0445012 -0.0154702 -0.0626526 -0.134459 0.0426252 -0.0110753 -0.00191 -0.0754893 0.0522287 -0.091027 -0.0215543 -0.0363938 0.0153672 -0.0151372 0.0100792 0.0162343 0.0480483 -0.11083 0.1141486 0.0144522 0.0732013 0.0361825 0.0341895 -0.0557741 -0.0048931 -0.0224501 0.0336938 0.0245285 -0.0131969 -0.0070057 -0.0507747 0.0062293 -0.0587561 -0.0687823 -0.0609454 -0.0264001 -0.1260349 -0.0515293 -0.0980531 -0.0694756 0.0430168 0.0417014 -0.0109087 0.0232209 -0.0938203 0.1012872 -0.0092168 0.0645471 0.0255524 0.1531264 -0.037843 -0.0438039 -0.0062536 0.2244988 -0.0258619 -0.0756684 -0.048764 0.3156013 0.0575943 -0.0118602 -0.0343654 -0.0522637 -0.0175375 -0.1208411 -0.0930195 -0.1088971 -0.0319867 0.0680842 -0.0157806 -0.0060978 0.0490153 -0.132138 0.1006646 -0.0462765 0.0999704 0.048424 -0.0901999 0.0053513 0.1128661 -0.0013109 0.0998974 0.0149606 0.1477666 0.013863 -0.0500886 unknown
polarizability: 130.1881744|4.0813647|104.503202|0.5925744|-6.3974085|93.5893979 unknown
InChI: InChI=1S/C7H11BrN2O2/c1-2-3-10-4-5(8)6(11)9-7(10)12/h5,9H,2-4H2,1H3
charge 0 multiplicity 1
23 atoms
Br -1.928047 -1.902143 1.513859
O  0.619077 2.143634 0.817226
O  -3.450638 0.469111 -0.719738
N  0.581542 -0.09195 0.090661
N  -1.353241 1.273939 -0.085036
C  -0.132263 -1.112995 -0.692796
C  1.985544 -0.332115 0.488019
C  -1.62508 -1.143247 -0.359802
C  2.987124 -0.22125 -0.685384
C  0.019931 1.152737 0.313524
C  -2.250826 0.252035 -0.409833
C  4.431891 -0.493922 -0.215935
H  0.324044 -2.096454 -0.4926
H  -0.037037 -0.915676 -1.784781
H  2.235114 0.416244 1.259516
H  2.046057 -1.337227 0.950141
H  -2.18774 -1.822183 -1.015678
H  2.714451 -0.938774 -1.485412
H  2.914776 0.793281 -1.120386
H  -1.729807 2.224921 -0.016416
H  4.742262 0.235391 0.554969
H  4.529662 -1.507044 0.218017
H  5.143905 -0.417915 -1.056736
