program: Gaussian 09
title: 000242066
version: EM64L-G09RevD.01
frameworkgroup: C1[X(C6H9BrN2O2)]
method: RPBEPBE
basis: SDD
operation: Freq
keyword: #p
keyword: freq=noraman
keyword: PBEPBE/SDD
title: #p freq=noraman PBEPBE/SDD
converged: NO NO NO NO
title: Mulliken charges:
elementType: Br O O N N C C C C C C H H H H H H H H H
charge: 0.044027 -0.196021 -0.253568 -0.373221 -0.362569 0.301124 -0.599927 -0.671190 -0.717873 0.200394 0.186031 0.324972 0.224435 0.231108 0.244788 0.235005 0.257532 0.221361 0.340258 0.363335
chargesum: 0.00000
title: Mulliken charges with hydrogens summed into heavy atoms:
elementType: Br O O N N C C C C C C
charge: 0.044027 -0.196021 -0.253568 -0.032963 0.000766 0.301124 -0.274955 0.029142 -0.003976 0.200394 0.186031
polarizability: 1.04195158e+02 4.24077875e-01 9.58180610e+01 1.75246406e+00 -1.05792169e+00 9.47964923e+01
1716.lowfreq: -12.5106 -4.2582 -0.0008 -0.0007 -0.0006 11.9134 60.7295 125.6521 134.1568
frequency: 60.6878 125.6082 134.1537 158.7438 172.8852 214.1143 243.6727 263.4197 302.9985 332.6951 361.6750 443.9766 477.6112 497.7489 530.1468 536.1189 574.4017 612.2552 694.4162 735.6098 763.9886 860.5723 889.1598 917.3005 920.8453 953.1856 1006.9747 1017.8318 1147.2267 1165.3607 1183.3005 1232.9341 1270.8558 1295.2943 1364.2242 1370.2783 1384.4094 1393.9970 1415.7167 1461.4365 1464.9739 1480.5739 1488.2078 1636.9773 1676.6559 2991.0568 2994.1017 3087.4233 3094.2498 3099.4989 3110.5981 3121.2367 3530.2903 3570.6122
redmass: 12.6779 3.5718 8.1967 4.8333 6.1736 1.0927 1.2956 2.9231 2.6741 3.3150 5.2243 3.7773 4.9336 3.7585 4.2718 1.3698 4.8039 3.5310 3.1832 3.1156 2.7099 3.6828 3.6360 2.8037 1.9609 1.6110 1.3788 2.1805 1.5799 1.9570 1.8121 4.7440 1.5073 4.1131 1.7209 6.9013 1.2025 1.3363 1.3155 1.0546 1.0483 1.0744 1.0594 8.3432 5.5405 1.0353 1.0366 1.0991 1.1003 1.1005 1.1001 1.0880 1.0771 1.0778
irintensity: 0.0744 0.2698 2.4512 0.2588 1.3228 0.2274 0.5425 2.2617 0.5769 6.4771 15.6675 2.6470 4.7028 40.4427 16.8137 55.1712 12.3146 3.7269 11.4090 110.7370 74.2912 0.5433 12.1635 3.2971 4.0682 5.1108 5.2648 14.2711 29.0618 5.3667 3.4374 22.3716 16.0306 200.7310 4.3644 249.7256 13.1613 31.3581 1.4185 5.6385 2.5688 4.0070 12.7485 242.7826 560.2153 11.0914 21.5634 8.7901 23.2102 20.9103 13.0741 2.6102 64.9565 43.3244
temp: 298.150 k
press: 1.00000 atm
elementType: 35 8 8 7 7 6 6 6 6 6 6 1 1 1 1 1 1 1 1 1
symmnumber: 1
zpe: 399757.8 jmol-1
zpe.correction: 0.152260 hartree
zpe.thermalcorrener: 0.163410 hartree
zpe.thermalcorrenthalpy: 0.164354 hartree
zpe.thermalcorrgfe: 0.114925 hartree
zpe.sumelectzpe: -506.645797 hartree
zpe.sumelectthermal: -506.634647 hartree
zpe.sumelectthermalent: -506.633703 hartree
zpe.sumelectthermalfe: -506.683132 hartree
dipole: -0.2777 4.9991 1.1749
dipole: 5.1428
quadrupole: -81.3433 -70.7833 -81.5658
quadrupole: -1.9241 -7.5180 2.6080
quadrupole: -3.4458 7.1141 -3.6683 -1.9241 -7.5180 2.6080
hfenergy: -506.798057 hartree
pointgroup: C01 [X(C6H9Br1N2O2)]
dipole: 1.7365005 0.8115907 0.647941 debye
dipolederiv: -0.1553384 0.0112614 0.0550057 -0.0118525 -0.1534443 -0.118601 0.0760239 -0.2002475 -0.4874397 -0.5487018 -0.1658042 0.1769496 -0.0383832 -1.0143595 0.2659744 0.0581403 0.2948638 -0.4229546 -1.0065009 0.3069854 -0.1309203 0.3928244 -0.8894719 0.1411206 -0.1757564 0.1675578 -0.4162926 -1.2197492 -0.0028075 -0.0989475 -0.0787597 -0.4143154 -0.0690016 0.0421934 -0.0260428 -0.4762337 -0.4861183 0.3817956 -0.0131503 0.0969273 -1.4280167 0.2272633 -0.0056536 0.2739827 -0.4078794 0.4434445 -0.0893168 0.1146345 -0.2572388 0.2935283 0.0158081 0.116663 -0.1557226 0.1767391 -0.150921 -0.0373278 0.1121039 0.0200417 0.1684141 0.2765949 0.0281931 0.3432603 0.6567748 -0.0352806 -0.0220196 -0.0074571 0.028426 -0.0630311 -0.1717672 -0.0229176 0.0531689 -0.06124 -0.0633149 0.0085548 0.0351422 -0.0382957 0.0299212 0.0287033 0.020545 -0.0002247 -0.0169229 0.8990247 -0.431833 -0.3213575 -0.1335819 1.4519134 -0.3917468 -0.1454895 -0.4362407 0.3204753 1.7646937 -0.0391045 0.1416305 -0.1238589 1.6175198 -0.2966872 0.1329934 -0.4512991 0.4057315 0.040931 0.0308513 -0.0031236 0.0455584 0.041057 -0.0206358 -0.0354678 0.0101218 -0.0580117 -0.0302121 0.0884179 -0.0718429 0.1143421 0.0220943 0.0634796 -0.0760737 0.0252234 0.0509139 0.0921165 -0.0504062 -0.0281978 -0.0583412 -0.1011217 -0.0660079 -0.0017085 -0.0400652 0.0217427 -0.0644266 -0.032872 0.0997618 -0.0441132 0.0844795 0.0398998 0.0681412 0.0272661 0.0540223 -0.0209425 0.0601404 -0.0279108 0.1160233 0.0127827 0.0588644 -0.0603768 0.0634897 0.0680069 0.0968162 0.0043463 -0.0198122 0.0050996 0.1173001 -0.0141089 0.0230594 0.0131779 -0.090939 0.0622292 -0.0239405 -0.0006522 -0.087814 -0.1260104 -0.0597569 -0.0104057 -0.0802692 0.0773054 0.1516097 -0.0009855 -0.0185584 0.0196222 0.1894166 0.0458437 -0.0289105 0.0309605 0.2941811 0.2306408 0.0040645 0.0067024 0.0333741 0.161344 0.0447612 -0.0031927 0.087039 0.3120204 unknown
polarizability: 97.8952069|-3.0185149|100.9939906|-2.8545096|2.6762948|95.9205141 unknown
InChI: InChI=1S/C6H9BrN2O2/c1-6(2)3(7)4(10)8-5(11)9-6/h3,8-9H,1-2H3
charge 0 multiplicity 1
20 atoms
Br 0.870254 -1.494489 -1.993016
O  -1.077118 -2.368885 0.873624
O  -2.127551 1.941806 -0.586095
N  0.128203 1.37213 -0.309638
N  -1.564343 -0.186048 0.213273
C  1.171846 0.481731 0.259694
C  0.751583 -0.98333 -0.016974
C  1.246149 0.655686 1.812508
C  2.53215 0.851406 -0.3645
C  -0.696489 -1.267362 0.399329
C  -1.228431 1.11883 -0.265333
H  1.417581 -1.701617 0.481556
H  2.035769 0.01455 2.243021
H  1.485978 1.707025 2.046577
H  0.288287 0.406518 2.301109
H  3.319192 0.167555 -0.003738
H  2.497418 0.790548 -1.464391
H  2.81563 1.878683 -0.069685
H  0.397327 2.286207 -0.675603
H  -2.564035 -0.347345 0.370281
