program: Gaussian 09
title: 000241653
version: EM64L-G09RevD.01
frameworkgroup: C1[X(C12H19N3)]
method: RPBEPBE
basis: SDD
operation: Freq
keyword: #pfreq=noraman
keyword: PBEPBE/SDD
title: #p freq=noraman PBEPBE/SDD
converged: YES YES NO NO
title: Mulliken charges:
elementType: N N N C C C C C C C C C C C C H H H H H H H H H H H H H H H H H H H
charge: -0.199747 -0.628287 -0.326725 0.195328 -0.422791 0.412607 -0.009776 -0.730689 -0.653158 -0.636914 -0.384909 -0.365626 -0.242409 -0.273857 -0.244053 0.224303 0.176215 0.295340 0.226904 0.190684 0.217455 0.251545 0.215316 0.262527 0.216270 0.189138 0.264891 0.246623 0.297631 0.357972 0.221382 0.226138 0.203699 0.226975
chargesum: 0.00000
title: Mulliken charges with hydrogens summed into heavy atoms:
elementType: N N N C C C C C C C C C C C C
charge: -0.199747 0.027316 -0.123027 0.195328 -0.022274 0.412607 -0.009776 -0.017760 0.031158 0.031021 -0.120018 -0.119003 -0.021028 -0.047719 -0.017078
polarizability: 1.70143519e+02 -3.43522806e+00 1.38264751e+02 1.42905935e+00 1.10943955e+01 1.32854197e+02
1716.lowfreq: -0.0008 -0.0005 -0.0003 7.5389 12.5469 16.6142 52.2658 77.7139 93.7725
frequency: 52.0560 77.6811 93.7669 117.1122 168.7163 182.0185 200.0931 212.5769 229.8031 244.6810 273.8366 282.7777 296.1821 316.8914 328.8588 359.7145 392.1015 408.4816 414.8793 442.3077 487.0154 506.1538 540.1594 566.9893 617.5654 649.7411 677.1059 708.7780 744.5949 752.4759 774.9524 822.0345 863.6747 865.9063 910.0358 940.6509 946.3719 975.4783 988.4099 992.6920 997.7915 1031.4663 1036.6173 1052.0714 1074.4250 1081.4492 1085.6520 1093.8777 1100.3900 1132.5671 1149.9323 1173.7425 1180.2002 1204.9275 1220.4381 1241.8109 1294.4536 1323.0325 1340.2073 1357.0191 1374.6489 1380.7394 1420.0297 1433.2780 1441.4800 1460.3290 1467.2024 1470.1045 1473.2570 1483.0372 1486.1136 1494.2532 1507.9289 1529.0315 1587.0591 1610.0418 1628.1695 2883.3565 2917.3675 2963.8385 2983.3762 3021.6788 3028.6534 3045.5189 3074.5739 3085.0024 3109.2522 3113.6971 3120.0792 3129.4099 3144.9409 3155.0422 3164.9909 3301.2346 3388.7501 3628.0436
redmass: 3.7166 4.5324 3.4275 3.6588 3.2619 2.1813 2.0382 2.5139 1.6171 1.3034 1.1503 3.0412 2.3940 3.1153 3.5990 2.8452 2.7605 2.7492 2.8697 1.2915 3.2427 3.1021 2.8998 2.9749 6.3328 3.2852 4.8928 1.7302 1.1727 1.5791 1.5412 1.3886 1.2407 3.1755 2.1112 1.5361 2.1545 3.0280 1.3883 5.9943 1.3216 2.3492 1.5484 1.8730 2.1258 1.4938 1.3840 2.0182 1.7890 1.7865 1.7801 1.0665 3.4452 1.1596 2.5522 2.2328 1.2916 1.4783 1.3339 2.3325 6.0931 1.2143 1.1351 2.2188 1.1693 1.0674 1.0737 1.0545 1.0630 1.1342 1.7246 1.0590 1.0510 1.2024 5.8783 5.9380 6.1137 1.0556 1.0486 1.0650 1.0393 1.0843 1.0782 1.0931 1.0957 1.0989 1.0966 1.0997 1.0844 1.0883 1.0927 1.0951 1.0997 1.0755 1.0520 1.0954
irintensity: 0.2741 1.4033 1.4667 0.2267 0.5329 0.3760 1.2079 2.1455 2.0759 1.8295 0.0511 0.0564 1.6440 8.3896 2.4070 4.3202 11.0237 29.8280 14.2992 107.7307 13.2643 11.7793 0.2451 13.9033 0.0779 5.2909 7.2782 48.4871 121.0547 47.7995 20.8184 34.2209 0.1555 0.8456 10.9182 12.4481 39.4682 59.5979 0.9583 0.7349 1.3145 3.6211 16.6597 16.7564 16.6268 46.1693 11.8383 14.8470 11.1258 0.9902 1.8867 0.0077 3.8260 1.2366 10.5456 7.8542 7.3935 14.7071 9.2555 56.0616 3.1225 33.6679 2.8246 9.3081 10.9491 5.2573 14.4922 6.4307 8.1602 21.9914 7.8197 7.9283 7.7097 168.2176 1.1471 12.1376 160.6590 78.3320 94.6983 44.6496 63.9417 44.6507 45.3638 11.1676 55.7320 26.1102 23.1797 7.1791 0.4225 8.8213 29.6248 21.3163 19.8514 30.3569 95.8820 38.3452
temp: 298.150 k
press: 1.00000 atm
elementType: 7 7 7 6 6 6 6 6 6 6 6 6 6 6 6 1 1 1 1 1 1 1 1 1 1 1 1 1 1 1 1 1 1 1
symmnumber: 1
zpe: 766225.5 jmol-1
zpe.correction: 0.291840 hartree
zpe.thermalcorrener: 0.307280 hartree
zpe.thermalcorrenthalpy: 0.308224 hartree
zpe.thermalcorrgfe: 0.250913 hartree
zpe.sumelectzpe: -631.744190 hartree
zpe.sumelectthermal: -631.728751 hartree
zpe.sumelectthermalent: -631.727806 hartree
zpe.sumelectthermalfe: -631.785117 hartree
dipole: 0.8540 1.2630 -2.7567
dipole: 3.1502
quadrupole: -84.0202 -86.7544 -91.9345
quadrupole: -1.2336 -5.1213 9.3852
quadrupole: 3.5495 0.8153 -4.3648 -1.2336 -5.1213 9.3852
hfenergy: -632.0360303 hartree
pointgroup: C01 [X(C12H19N3)]
dipole: 0.2786162 0.331757 -1.1611989 debye
polarizability: 170.2786888|-2.4736607|141.3761892|-0.0761624|9.9402679|129.6075887 unknown
InChI: InChI=1S/C12H19N3/c1-4-12(11(13)14,15(2)3)10-8-6-5-7-9-10/h5-9,13H,4,14H2,1-3H3
charge 0 multiplicity 1
34 atoms
N  1.393423 0.959011 -1.029672
N  1.712141 -1.60903 -1.430461
N  1.816683 -2.080364 0.947904
C  0.88922 0.098658 0.140103
C  1.3472 0.706393 1.512786
C  -0.658349 -0.017036 0.051061
C  1.533344 -1.312004 -0.082267
C  0.747308 0.107735 2.805177
C  2.842293 1.285948 -0.943902
C  0.611553 2.169269 -1.364659
C  -1.293245 -1.080392 -0.640303
C  -1.489072 0.96894 0.650118
C  -2.702141 -1.158602 -0.728314
C  -2.89556 0.897985 0.562243
C  -3.512897 -0.169966 -0.128807
H  2.444529 0.59158 1.570171
H  1.145948 1.798292 1.479499
H  0.989823 -0.9649 2.853563
H  -0.349202 0.222023 2.853054
H  1.18108 0.61804 3.686777
H  3.179989 1.65436 -1.930663
H  3.423302 0.381485 -0.696701
H  3.079067 2.07034 -0.190035
H  -0.433988 1.910484 -1.587527
H  1.054585 2.62408 -2.269836
H  0.616788 2.945929 -0.561997
H  -0.683087 -1.855327 -1.113255
H  -1.036595 1.807849 1.189518
H  2.136453 -2.483169 -1.734477
H  1.563521 -0.815198 -2.068548
H  -3.164155 -1.995966 -1.26411
H  -3.507482 1.674103 1.036076
H  2.211754 -3.002665 0.665974
H  -4.60513 -0.231486 -0.19439
