program: Gaussian 09
title: 000241652
version: EM64L-G09RevD.01
frameworkgroup: C1[X(C10H16N2)]
method: RPBEPBE
basis: SDD
operation: Freq
keyword: #pfreq=noraman
keyword: PBEPBE/SDD
title: #p freq=noraman PBEPBE/SDD
converged: YES YES NO NO
title: Mulliken charges:
elementType: N N C C C C C C C C C C H H H H H H H H H H H H H H H H
charge: -0.126153 -0.545146 -0.146549 0.452722 -0.478369 -0.635364 -0.630308 -0.373391 -0.478220 -0.233709 -0.226908 -0.244746 0.174342 0.226891 0.227098 0.241827 0.187747 0.217852 0.217427 0.187408 0.253653 0.269918 0.240340 0.288044 0.259447 0.223834 0.223768 0.226545
chargesum: 0.00000
title: Mulliken charges with hydrogens summed into heavy atoms:
elementType: N N C C C C C C C C C C
charge: -0.126153 0.002345 0.027793 0.452722 -0.024380 0.012062 0.028180 -0.103473 -0.237880 -0.009875 -0.003140 -0.018201
polarizability: 1.50930840e+02 -3.63264690e+00 9.92111344e+01 1.55114557e+00 1.37788994e+01 1.04637586e+02
1716.lowfreq: -13.1907 -11.9526 -9.7566 -0.0006 -0.0006 0.0002 41.0309 74.8662 81.6978
frequency: 40.4779 74.8192 81.6706 114.3531 169.5564 183.1602 228.4595 239.7863 271.2038 301.4081 318.5208 352.0314 379.0311 406.7464 423.4599 491.1300 546.8126 597.9345 611.8349 620.4079 707.5500 748.8871 772.9369 849.4407 860.3953 910.1123 927.2655 982.0733 982.8955 989.6750 998.7662 1021.5606 1027.5116 1035.0530 1074.3741 1088.5811 1104.2197 1118.5389 1135.4032 1169.4464 1178.4519 1197.8471 1211.7189 1249.0009 1287.2126 1296.6365 1321.9226 1331.1685 1358.0695 1385.2625 1417.5592 1437.0557 1445.0016 1456.6449 1466.7534 1472.0316 1478.4922 1481.6187 1489.6013 1590.8183 1610.0784 1647.0860 2795.6342 2850.0856 2865.5651 2999.3970 3029.0776 3033.6097 3067.6662 3090.0304 3094.0130 3113.2531 3122.5107 3134.9798 3145.7996 3160.6559 3456.7505 3582.2995
redmass: 3.5844 2.8114 3.5119 2.2967 2.4063 2.7827 1.1889 1.3458 2.2859 1.2535 2.7361 2.8801 2.7279 2.8508 2.8510 2.6654 2.5827 3.8807 2.6851 2.2745 1.7714 2.2443 2.2488 3.9026 1.2779 1.5005 1.5313 1.3788 2.8946 4.9192 1.4093 2.1791 1.9921 1.6668 1.5994 1.3021 2.9645 1.5863 1.4688 1.0635 1.1173 2.3370 2.6570 2.3493 1.4817 1.3920 1.1976 1.2790 1.4055 5.3700 1.1455 1.9147 1.2467 1.0832 1.0634 1.0540 2.1146 1.0880 1.0515 6.1170 6.1632 1.0878 1.0803 1.0573 1.0571 1.0603 1.0736 1.0728 1.1041 1.0993 1.0995 1.0863 1.0864 1.0916 1.0955 1.1014 1.0446 1.0975
irintensity: 0.8074 0.4018 0.3282 0.8958 2.0691 1.2779 0.4413 2.6819 7.4748 41.7954 12.6277 2.0604 11.3837 0.3764 11.1717 6.7603 3.7868 3.1280 164.8273 229.7830 46.0972 27.3547 13.3407 21.1186 0.7169 6.7309 1.4201 0.1486 23.6076 1.4351 5.5549 25.2774 12.8949 26.8888 7.9938 9.0006 16.5246 4.5855 4.2673 0.1972 0.6743 3.6540 4.3666 4.9245 7.5868 1.2768 4.2907 0.8646 18.5859 4.1706 1.7154 9.7964 12.8091 11.4432 13.3163 0.8150 13.3338 6.8589 23.2927 0.9054 4.7275 20.1301 69.3321 77.7794 194.0936 33.6934 32.4266 53.3482 37.1013 30.3835 32.3991 7.8168 0.6386 19.7503 30.1798 26.6171 0.4411 1.3730
temp: 298.150 k
press: 1.00000 atm
elementType: 7 7 6 6 6 6 6 6 6 6 6 6 1 1 1 1 1 1 1 1 1 1 1 1 1 1 1 1
symmnumber: 1
zpe: 635868.1 jmol-1
zpe.correction: 0.242189 hartree
zpe.thermalcorrener: 0.254895 hartree
zpe.thermalcorrenthalpy: 0.255839 hartree
zpe.thermalcorrgfe: 0.203343 hartree
zpe.sumelectzpe: -499.206887 hartree
zpe.sumelectthermal: -499.194181 hartree
zpe.sumelectthermalent: -499.193237 hartree
zpe.sumelectthermalfe: -499.245733 hartree
dipole: -0.2323 -0.6915 1.5273
dipole: 1.6925
quadrupole: -65.9927 -79.0439 -71.7404
quadrupole: 1.7221 -1.4408 6.4692
quadrupole: 6.2663 -6.7849 0.5186 1.7221 -1.4408 6.4692
hfenergy: -499.4490762 hartree
pointgroup: C01 [X(C10H16N2)]
dipole: 0.055272 0.2282325 0.623102 debye
polarizability: 151.161917|1.1860059|101.2980282|0.6809525|-14.1182965|102.3196151 unknown
InChI: InChI=1S/C10H16N2/c1-12(2)10(8-11)9-6-4-3-5-7-9/h3-7,10H,8,11H2,1-2H3
charge 0 multiplicity 1
28 atoms
N  1.897744 0.994894 0.030752
N  0.88738 -2.717862 -0.379061
C  1.147156 -0.257187 0.335886
C  -0.357634 -0.039024 0.171249
C  1.595647 -1.448959 -0.594567
C  3.36546 0.829778 -0.049989
C  1.54525 2.08995 0.964188
C  -0.859226 0.660819 -0.957149
C  -1.278756 -0.601026 1.089346
C  -2.249697 0.799324 -1.157567
C  -2.673578 -0.466541 0.890304
C  -3.163564 0.233156 -0.235659
H  1.341305 -0.588019 1.394124
H  2.671693 -1.646061 -0.446781
H  1.458534 -1.131514 -1.645352
H  3.647316 0.184857 -0.897879
H  3.818245 0.404678 0.88227
H  3.822468 1.820343 -0.223142
H  2.048619 3.020891 0.647156
H  1.844772 1.874912 2.021387
H  0.457157 2.264954 0.947689
H  -0.140743 1.109285 -1.652678
H  -0.902188 -1.13112 1.97303
H  -0.122883 -2.66951 -0.545165
H  1.105209 -3.179554 0.509243
H  -2.623286 1.347238 -2.030476
H  -3.373638 -0.902404 1.612506
H  -4.243062 0.341203 -0.391165
