program: Gaussian 09
title: 000241629
version: EM64L-G09RevD.01
frameworkgroup: C1[X(C22H16O2)]
method: RPBEPBE
basis: SDD
operation: Freq
keyword: #pfreq=noraman
keyword: PBEPBE/SDD
title: #p freq=noraman PBEPBE/SDD
converged: NO YES NO NO
title: Mulliken charges:
elementType: O O C C C C C C C C C C C C C C C C C C C C C C H H H H H H H H H H H H H H H H
charge: -0.186919 -0.186483 -0.091434 -0.632412 -0.077161 -0.079584 0.441780 0.282146 0.282318 0.480917 -0.395264 -0.396058 -0.380462 -0.380657 -0.397355 -0.396756 -0.210878 -0.210896 -0.240743 -0.239975 -0.239018 -0.240021 -0.240354 -0.239863 0.251355 0.251252 0.281391 0.280883 0.279636 0.279657 0.255480 0.255166 0.240736 0.240751 0.226606 0.226590 0.229212 0.224809 0.224833 0.226776
chargesum: 0.00000
title: Mulliken charges with hydrogens summed into heavy atoms:
elementType: O O C C C C C C C C C C C C C C C C C C C C C C
charge: -0.186919 -0.186483 -0.091434 -0.129805 -0.077161 -0.079584 0.441780 0.282146 0.282318 0.480917 -0.113873 -0.115175 -0.100825 -0.101000 -0.141874 -0.141591 0.029858 0.029855 -0.014137 -0.013385 -0.009806 -0.015211 -0.015521 -0.013087
polarizability: 2.70361349e+02 -3.21678608e+01 1.94446460e+02 1.63727353e-01 5.83219263e-01 2.28241922e+02
1716.lowfreq: -9.5188 -4.9278 -0.0004 0.0003 0.0005 0.4725 14.1633 21.4323 30.3993
frequency: 13.6301 21.4269 30.3441 48.4274 67.8448 103.5028 106.6136 148.5952 165.2479 166.5922 188.6276 229.7638 239.3665 245.3627 296.2748 328.2632 337.1175 389.1538 403.0512 405.3397 425.8900 447.6575 479.3742 519.6714 526.3685 533.7469 567.6256 600.7803 615.0165 617.5374 659.4290 677.1143 689.3784 700.6073 706.2277 709.1921 753.5299 770.6485 784.0505 785.5029 812.1997 822.7919 857.6889 863.6672 873.7894 907.5729 913.4249 931.9688 936.3303 956.5379 980.3167 985.5436 989.3166 990.4859 991.6193 995.8435 1000.5615 1012.1339 1012.3720 1014.6874 1028.0837 1033.2410 1082.8127 1085.8617 1097.9740 1102.9385 1167.3374 1172.0897 1175.1402 1177.0414 1184.4677 1191.2980 1205.7286 1216.5047 1228.5487 1249.7193 1282.5663 1314.3424 1331.2107 1334.2821 1373.4418 1381.4236 1409.2437 1434.3371 1441.5644 1453.4017 1454.7754 1459.6144 1481.5752 1483.7394 1585.1940 1586.7933 1591.0411 1601.2338 1605.3406 1613.0509 1622.2669 1645.2238 3007.1295 3070.3979 3120.6680 3124.8514 3126.2485 3135.5301 3137.1325 3137.5626 3146.8554 3150.3391 3151.3485 3158.5220 3162.5349 3163.1565 3167.0400 3172.3144
redmass: 3.8369 6.0171 4.3139 5.6855 4.1461 4.1084 6.0284 8.6129 8.0495 4.4889 5.2944 4.6493 6.0756 7.3879 5.5939 10.6984 1.9854 4.1095 2.8949 2.8376 3.5457 4.3286 3.7656 5.0845 7.5388 6.9700 4.9948 5.2513 6.3933 6.2886 4.6533 6.1415 5.9353 3.7382 1.9661 1.7719 1.8600 1.8634 1.5353 3.6966 3.4454 3.8971 1.2436 1.2421 3.9713 2.2691 2.0387 1.5881 1.5575 3.7349 1.3834 1.5591 6.0246 5.6522 1.3724 1.3366 1.3234 2.0904 1.3645 2.5836 2.2402 2.3416 2.2200 1.6819 1.5907 4.3029 1.5546 1.0534 1.0518 1.9805 2.0323 1.1361 1.1333 2.6612 1.3279 3.6172 1.6383 1.4976 1.3711 1.2608 6.2570 7.4126 7.8912 2.2623 2.1749 2.5476 2.1856 1.2140 2.0568 2.2586 7.3685 6.4140 6.0147 7.6406 5.8524 6.0284 9.2396 12.3348 1.0593 1.1037 1.0845 1.0848 1.0877 1.0889 1.0864 1.0924 1.0965 1.0929 1.0902 1.0948 1.1016 1.0956 1.1008 1.1003
irintensity: 0.0036 3.3530 0.1134 0.9303 0.1425 0.1150 2.7104 0.1030 7.6181 1.0449 0.0656 0.3354 1.6381 0.1983 0.1205 10.7737 0.6009 0.0658 0.0065 0.0223 1.0213 0.0070 0.8137 17.3651 1.2996 7.3372 51.2937 12.8095 0.0021 0.0276 0.0012 1.4689 0.1231 13.5051 29.1968 76.5287 0.4291 76.1614 75.4488 0.0028 2.1012 0.0012 1.0061 0.0209 20.5623 2.3547 1.4431 14.8675 3.8269 20.0152 0.7721 2.1921 0.6375 0.1303 0.0033 0.9434 0.6265 0.3931 0.0040 1.0252 10.5925 16.5171 0.3176 21.3818 1.2895 6.2856 7.7023 0.0014 0.1235 19.0062 2.6265 1.4935 12.3738 3.6564 3.5246 214.1867 1.2098 41.7569 3.4341 1.7704 0.0747 0.2326 10.7137 16.2253 8.6331 1.4649 0.5913 14.8474 47.3712 23.2686 101.6907 48.7242 0.0904 1.9008 14.7515 6.4169 64.8370 84.3654 19.5340 2.6978 1.8267 0.0079 1.6140 15.8179 2.1821 16.8733 27.7084 13.1029 5.1017 7.7039 25.7130 4.5521 32.1815 24.0740
temp: 298.150 k
press: 1.00000 atm
elementType: 8 8 6 6 6 6 6 6 6 6 6 6 6 6 6 6 6 6 6 6 6 6 6 6 1 1 1 1 1 1 1 1 1 1 1 1 1 1 1 1
symmnumber: 1
zpe: 815666.7 jmol-1
zpe.correction: 0.310671 hartree
zpe.thermalcorrener: 0.329872 hartree
zpe.thermalcorrenthalpy: 0.330816 hartree
zpe.thermalcorrgfe: 0.260569 hartree
zpe.sumelectzpe: -996.766190 hartree
zpe.sumelectthermal: -996.746990 hartree
zpe.sumelectthermalent: -996.746045 hartree
zpe.sumelectthermalfe: -996.816292 hartree
dipole: -0.8502 3.1122 -0.0191
dipole: 3.2263
quadrupole: -124.6423 -126.7280 -138.0916
quadrupole: -8.4685 0.0316 0.0564
quadrupole: 5.1783 3.0926 -8.2709 -8.4685 0.0316 0.0564
hfenergy: -997.0768613 hartree
pointgroup: C01 [X(C22H16O2)]
dipole: -0.3988447 1.1937429 0.1645909 debye
polarizability: 273.5502478|-27.71245|191.8577297|-3.8183861|-4.7075388|227.6417532 unknown
InChI: InChI=1S/C22H16O2/c23-20-18-13-7-8-14-19(18)21(24)22(20,17-11-5-2-6-12-17)15-16-9-3-1-4-10-16/h1-14H,15H2
charge 0 multiplicity 1
40 atoms
O  0.15958 0.450914 -2.36955
O  0.153747 -0.220913 2.423936
C  0.654588 -0.318347 -0.032761
C  0.135966 -1.793099 -0.238002
C  0.100587 0.640209 -1.125591
C  0.098054 0.303486 1.279929
C  2.208073 -0.341473 -0.036599
C  -0.542473 1.803191 -0.452762
C  -0.544393 1.606484 0.951097
C  -1.378682 -1.946836 -0.266375
C  2.926356 -0.237788 -1.25684
C  2.930281 -0.563264 1.165481
C  -1.118488 2.95387 -1.029349
C  -1.122701 2.55439 1.820304
C  -2.106194 -2.191312 0.928136
C  -2.091751 -1.862502 -1.491295
C  -1.692883 3.910256 -0.162192
C  -1.695053 3.712514 1.24799
C  4.335237 -0.337194 -1.269988
C  4.339324 -0.66201 1.147039
C  5.049654 -0.546954 -0.069021
C  -3.510671 -2.3432 0.900162
C  -3.496112 -2.014028 -1.521452
C  -4.211225 -2.254441 -0.325194
H  0.572672 -2.390124 0.583387
H  0.57937 -2.147658 -1.186363
H  2.38533 -0.085304 -2.195746
H  2.393121 -0.664689 2.113522
H  -1.11646 3.088825 -2.115414
H  -1.123653 2.385255 2.901578
H  -1.566273 -2.262944 1.879743
H  -1.540971 -1.678163 -2.42133
H  -2.148109 4.817161 -0.574861
H  -2.151842 4.471153 1.892832
H  4.872958 -0.252638 -2.22113
H  4.880206 -0.831556 2.084926
H  6.142678 -0.623088 -0.081127
H  -4.055854 -2.536246 1.831072
H  -4.030166 -1.950725 -2.476382
H  -5.300026 -2.377006 -0.348413
