program: Gaussian 09
title: 000241627
version: EM64L-G09RevD.01
frameworkgroup: C1[X(C7H11NO4)]
method: RPBEPBE
basis: SDD
operation: Freq
keyword: #p
keyword: freq=noraman
keyword: PBEPBE/SDD
title: #p freq=noraman PBEPBE/SDD
converged: YES YES NO NO
title: Mulliken charges:
elementType: O O O O N C C C C C C C H H H H H H H H H H H
charge: -0.265239 -0.252431 -0.181002 -0.175289 0.012227 0.335205 0.095125 -0.767823 -0.790531 0.219212 -0.254458 -0.663409 0.253307 0.234839 0.257479 0.298874 0.242418 0.229010 0.235437 0.233225 0.220494 0.235766 0.247565
chargesum: 0.00000
title: Mulliken charges with hydrogens summed into heavy atoms:
elementType: O O O O N C C C C C C C
charge: -0.265239 -0.252431 -0.181002 -0.175289 0.012227 0.335205 0.095125 -0.022198 -0.020229 0.219212 0.214204 0.040416
polarizability: 1.30807698e+02 1.03177286e+01 1.02055500e+02 4.64885925e+00 -1.57735147e-01 7.81982670e+01
1716.lowfreq: -12.8342 -5.7235 0.0006 0.0012 0.0015 2.5210 9.3202 54.6023 59.6235
frequency: -11.4270 54.4967 59.6027 73.1503 90.8634 110.2405 114.7201 141.3988 190.1830 198.2623 221.4314 312.3524 317.7526 376.5834 380.0844 421.3223 432.1687 485.6809 567.5925 652.6873 711.9632 746.7719 753.7089 806.9189 818.9136 917.9754 958.2444 970.7868 993.4101 1026.6361 1082.1877 1094.7447 1097.8556 1158.3993 1209.9632 1240.6107 1268.9264 1279.6139 1357.7429 1385.5488 1389.7203 1392.5533 1399.6782 1446.6956 1451.3339 1459.5131 1462.8374 1472.8392 1483.1305 1484.9942 1611.4126 1646.6464 2975.5911 2984.8649 2995.6633 3034.3645 3047.9340 3064.5138 3091.4130 3098.5517 3114.3228 3124.7093 3136.9860
redmass: 8.3527 4.5404 3.0570 1.1365 4.7935 1.1583 3.0011 2.5091 2.8440 6.4345 1.3599 2.9832 4.2639 3.7810 6.0552 3.8501 3.0126 3.1424 7.1446 8.0514 6.8734 9.8758 4.3704 3.0380 1.4957 2.9413 1.2961 1.3874 3.2425 4.7458 1.7120 2.1515 2.1107 1.6787 5.2292 10.7982 4.7234 1.1333 1.2830 5.5469 1.3260 1.2414 1.1900 1.0721 1.1063 1.0896 1.0484 1.0683 1.0629 1.0529 8.8093 6.2817 1.0404 1.0398 1.0361 1.0601 1.0949 1.0945 1.0975 1.1026 1.0993 1.1064 1.0974
irintensity: 1.1862 2.7438 2.9615 0.4447 0.3335 0.6943 0.1106 2.4903 2.9038 0.7642 0.8539 12.0450 4.7377 4.4448 4.5624 4.4913 2.2840 0.7671 5.3817 6.9004 23.7424 6.8128 3.4387 3.4059 3.2055 7.1607 0.7793 11.5142 1.7236 127.7105 7.1504 134.1450 97.6824 30.8683 197.1792 115.6931 27.7471 4.5314 2.3753 146.4477 61.4741 15.8025 41.4607 29.7940 35.6374 14.4322 12.9475 3.5934 28.5967 20.0199 140.3228 111.8678 12.3333 14.0066 17.3447 26.6540 11.8760 12.7471 32.4266 1.7637 10.7841 26.9248 1.5120
temp: 298.150 k
press: 1.00000 atm
elementType: 8 8 8 8 7 6 6 6 6 6 6 6 1 1 1 1 1 1 1 1 1 1 1
symmnumber: 1
zpe: 463264.4 jmol-1
zpe.correction: 0.176448 hartree
zpe.thermalcorrener: 0.189678 hartree
zpe.thermalcorrenthalpy: 0.190623 hartree
zpe.thermalcorrgfe: 0.135931 hartree
zpe.sumelectzpe: -627.954544 hartree
zpe.sumelectthermal: -627.941314 hartree
zpe.sumelectthermalent: -627.940369 hartree
zpe.sumelectthermalfe: -627.995061 hartree
dipole: 0.3759 2.8600 0.4687
dipole: 2.9224
quadrupole: -50.5080 -80.9670 -73.6365
quadrupole: 7.5601 1.0944 1.0687
quadrupole: 17.8625 -12.5965 -5.2660 7.5601 1.0944 1.0687
hfenergy: -628.1309921 hartree
pointgroup: C01 [X(C7H11N1O4)]
dipole: -0.2352616 0.8808333 -0.7005393 debye
dipolederiv: -1.6540221 0.238241 -0.0453491 0.4315115 -0.5172587 0.1052908 -0.2322355 0.122415 -0.3527448 -0.7382608 -0.1538914 0.0524865 -0.0155851 -0.8531259 0.200347 -0.0145455 0.2156742 -0.3760161 -0.1830171 -0.0329846 -0.0179058 0.0029482 -0.6898242 -0.1993508 -0.0395613 -0.0531892 -0.5621298 -0.196297 -0.0020106 0.0006847 0.0430817 -0.4889532 0.1079144 -0.0257713 -0.0621842 -0.7680152 0.0735698 0.0196253 0.0203051 0.0212012 1.0587051 0.0885009 0.0250956 0.1257296 1.1995688 0.7409084 -0.0168405 0.103861 -0.2160749 0.2266665 -0.1008557 0.2504414 -0.1339709 0.070217 -0.8875897 -0.0469719 -0.0447782 -0.1038839 -0.0862076 -0.0369945 -0.0561668 -0.0296296 -0.0993526 -0.2222016 -0.1329078 0.0080075 -0.1251257 -0.0599477 0.0297538 -0.1313154 0.0242113 0.0174018 -0.1718799 0.0912635 -0.0473288 0.0561273 -0.2012821 0.1108579 0.0391411 0.1030782 0.0022814 2.0663629 -0.0225287 0.0604531 -0.2130143 1.0577657 -0.2683006 0.1779482 -0.3098842 0.3478541 1.00016 -0.0552493 -0.0419753 0.1143835 0.2311655 0.0372079 -0.0567195 -0.0064361 0.3343083 -0.1203792 0.028244 0.0463999 -0.0331871 0.0442048 -0.0461753 0.0539412 -0.0087974 -0.1254864 0.0515445 -0.0113514 -0.022605 -0.0614162 0.0933373 -0.0584641 -0.0319388 -0.0526574 -0.0376306 -0.0222831 0.077226 0.028543 0.1093705 -0.0036009 -0.0389461 0.0916313 -0.0190651 0.108345 0.0825099 0.0215451 -0.0356809 -0.009928 0.0003549 0.0937208 0.0304311 0.0927219 0.0075497 0.0935261 -0.0973275 0.0789222 -0.0432756 0.0985396 0.0196977 0.0320144 0.0123063 0.1059483 0.0676354 0.0679782 0.0642442 0.0930263 0.0093552 -0.0273872 0.0570528 -0.069635 0.0129031 0.039576 -0.0176762 -0.1167681 -0.0245991 0.0685551 -0.0364691 -0.1467084 0.0182574 -0.0257863 -0.0089795 0.0455148 0.024563 -0.0769909 -0.076754 -0.0822181 0.0413657 -0.0316938 0.0537661 -0.0429915 0.0287949 -0.0341436 0.0447446 0.0606265 0.0931994 -0.0570286 0.0616521 -0.0533316 -0.1791552 -0.0501502 0.0138742 -0.0562666 0.1020883 -0.0078395 0.0409167 -0.0199345 0.0971019 0.1279418 -0.0412528 -0.0028784 0.0016112 -0.1123512 -0.0626264 0.01357 -0.0269924 0.061726 0.0833217 0.0627103 -0.0929313 0.0613413 0.0379406 0.0791367 -0.0615582 0.0480239 -0.0184783 unknown
polarizability: 132.3850398|-5.5435149|95.8465642|6.6314313|-9.3426753|82.8298619 unknown
InChI: InChI=1S/C7H11NO4/c1-4-12-7(9)6(5(2)3)8(10)11/h4H2,1-3H3
charge 0 multiplicity 1
23 atoms
O  1.665117 -0.171532 0.81924
O  0.913358 1.831504 -0.114459
O  -0.703443 -2.314345 0.514552
O  -0.595797 -1.236847 2.5246
N  -0.644988 -1.251302 1.239071
C  -1.874223 0.562509 0.122893
C  -0.663737 0.070596 0.536432
C  -3.16374 -0.202318 0.344016
C  -2.029036 1.886921 -0.590653
C  0.676965 0.694381 0.366597
C  3.081411 0.299452 0.710229
C  3.649222 -0.017379 -0.675425
H  -3.477432 -0.678287 -0.605625
H  -3.967623 0.497378 0.634982
H  -3.092409 -0.993579 1.106127
H  -1.071529 2.321781 -0.905742
H  -2.530187 2.609262 0.084063
H  -2.695381 1.75776 -1.46442
H  3.105877 1.382632 0.922413
H  3.594168 -0.25921 1.508576
H  4.722905 0.245585 -0.703006
H  3.551111 -1.092416 -0.9033
H  3.132291 0.564655 -1.456461
