program: Gaussian 09
title: 000241617
version: EM64L-G09RevD.01
frameworkgroup: C1[X(C15H14N2O2)]
method: RPBEPBE
basis: SDD
operation: Freq
keyword: #p
keyword: freq=noraman
keyword: PBEPBE/SDD
title: #p freq=noraman PBEPBE/SDD
converged: NO YES NO NO
title: Mulliken charges:
elementType: O O N N C C C C C C C C C C C C C C C H H H H H H H H H H H H H H
charge: -0.264826 -0.265254 -0.699757 -0.119653 0.185588 0.219975 0.315880 0.401304 -0.497154 -0.556723 -0.202168 -0.376682 0.299586 0.435632 -0.385244 -0.385199 -0.372384 -0.373131 -0.809390 0.299496 0.241291 0.237583 0.237588 0.189916 0.314625 0.315881 0.242048 0.242072 0.226029 0.226050 0.223055 0.230863 0.223099
chargesum: 0.00000
title: Mulliken charges with hydrogens summed into heavy atoms:
elementType: O O N N C C C C C C C C C C C C C C C
charge: -0.264826 -0.265254 -0.069250 -0.119653 0.185588 0.219975 0.315880 0.401304 -0.197658 -0.315432 0.273003 -0.186766 0.299586 0.435632 -0.143196 -0.143126 -0.146355 -0.147080 -0.132373
polarizability: 3.53200651e+02 2.09422655e+00 1.56229093e+02 1.02454747e-02 5.88285177e-02 1.21738822e+02
1716.lowfreq: -90.3704 -60.3440 -6.2205 -3.7646 -3.7319 -0.0010 -0.0009 -0.0007 22.5165
frequency: -90.3487 -60.3249 22.4143 26.8044 39.4628 64.9552 113.0716 116.3719 172.6551 174.2815 246.7696 273.3286 308.7126 323.0573 327.9736 378.3307 381.6023 385.2636 398.7323 422.9136 438.6166 460.3993 495.9949 515.7546 562.5124 589.9994 635.7905 655.9272 678.9017 715.4974 718.8622 732.2304 741.8688 769.8886 819.0694 823.9119 831.1099 836.5021 845.2318 878.2446 912.5470 937.0994 946.9239 959.1380 977.6194 984.0154 1006.9819 1028.4485 1031.3657 1046.2089 1064.6069 1114.7311 1118.7022 1145.8119 1181.1436 1189.5503 1219.8757 1223.4892 1236.1687 1296.4832 1297.5077 1351.6502 1362.8033 1385.0596 1397.1439 1407.8905 1449.2610 1458.9530 1471.9642 1472.9527 1474.9133 1488.1876 1500.2449 1569.0330 1607.2943 1618.2617 1621.9034 1639.9160 1651.4652 2931.1673 2969.2050 3010.6965 3049.2623 3078.9202 3087.1366 3114.2395 3116.5366 3147.3699 3152.1626 3163.2792 3180.3813 3571.5486 3709.3656
redmass: 3.6980 2.4183 1.7262 1.5881 4.8643 4.6012 5.0577 4.1085 4.7665 5.1456 4.0289 5.0255 3.3086 4.3689 1.8071 4.2885 1.4088 1.5629 2.9148 3.5793 5.8966 7.1994 4.4848 3.0196 4.2841 4.2229 6.9667 10.3436 9.8799 3.2233 3.1968 5.7268 5.8830 5.3725 2.0332 3.5537 1.2439 1.6244 9.7513 3.3784 1.3374 1.3105 1.6464 1.3609 5.1760 1.4019 2.8048 5.2731 1.5097 1.5295 1.4558 1.2820 1.0370 3.1220 1.2939 1.8151 2.9400 2.8530 1.3558 5.8243 1.3091 4.6891 1.2811 1.6152 1.2265 3.5756 3.8420 6.2321 1.0946 1.0523 2.5650 1.3478 2.8422 5.9951 7.6954 7.9690 5.7474 2.4854 1.8383 1.0848 1.0388 1.0534 1.0948 1.0996 1.1187 1.0886 1.0884 1.0948 1.0961 1.0927 1.0930 1.0453 1.1035
irintensity: 1.8346 15.5720 0.0123 1.1603 0.4953 0.3245 0.8181 0.7764 2.6674 1.4628 0.1010 0.8250 0.6714 9.1310 2.3321 7.3270 213.6202 61.9657 0.3199 16.2073 3.5063 12.4408 1.8804 21.1486 1.3155 26.5750 0.0806 0.0956 0.4128 2.7048 0.1153 4.2237 1.8197 15.7636 52.8779 30.6738 0.0934 42.8067 34.9221 9.2092 15.5554 1.2528 17.0112 0.0390 154.6832 1.2215 9.5052 42.8632 4.2911 18.7457 4.1595 14.9313 0.0051 33.5078 58.7215 133.2705 1.3856 59.4658 113.5881 380.2515 0.0678 1.7735 1.3043 45.6589 5.4971 0.0945 29.1764 12.1818 11.3131 11.1319 271.0866 56.2968 101.7071 2.9676 773.4866 24.9112 4.5591 12.8030 227.6157 63.9737 60.8155 151.8947 26.6419 19.3765 33.0681 15.1695 33.8921 26.0857 0.2414 7.1486 7.3402 54.9845 27.0783
temp: 298.150 k
press: 1.00000 atm
elementType: 8 8 7 7 6 6 6 6 6 6 6 6 6 6 6 6 6 6 6 1 1 1 1 1 1 1 1 1 1 1 1 1 1
symmnumber: 1
zpe: 670217.4 jmol-1
zpe.correction: 0.255272 hartree
zpe.thermalcorrener: 0.271190 hartree
zpe.thermalcorrenthalpy: 0.272134 hartree
zpe.thermalcorrgfe: 0.209812 hartree
zpe.sumelectzpe: -838.567990 hartree
zpe.sumelectthermal: -838.552073 hartree
zpe.sumelectthermalent: -838.551128 hartree
zpe.sumelectthermalfe: -838.613450 hartree
dipole: -1.2324 3.6122 -0.0012
dipole: 3.8166
quadrupole: -92.8158 -101.0148 -108.6644
quadrupole: 3.0726 -0.0019 0.0255
quadrupole: 8.0159 -0.1831 -7.8328 3.0726 -0.0019 0.0255
hfenergy: -838.8232621 hartree
pointgroup: C01 [X(C15H14N2O2)]
dipole: -0.4893399 -1.4195989 0.0000897 debye
polarizability: 353.1854395|-2.7169682|156.2442753|0.0016926|0.0669207|121.7388517 unknown
InChI: InChI=1S/C15H14N2O2/c1-10-2-4-12(5-3-10)17-8-11-6-14-15(7-13(11)16)19-9-18-14/h2-8H,9,16H2,1H3
charge 0 multiplicity 1
33 atoms
O  -3.971473 2.040197 -0.001554
O  -5.339722 0.061825 -0.000001
N  -1.490353 -3.000492 0.001916
N  1.055664 0.428449 -0.00066
C  -3.159585 0.868474 -0.000722
C  -3.975707 -0.290154 0.000181
C  -1.184023 -0.532692 0.000257
C  -2.017236 -1.708485 0.001044
C  -1.780557 0.773564 -0.000698
C  -3.445468 -1.574235 0.001045
C  -5.369397 1.556738 -0.000972
C  0.277961 -0.626694 0.000518
C  2.474358 0.305102 -0.000179
C  5.34126 0.197147 0.000395
C  3.197536 0.281064 -1.222992
C  3.197296 0.288418 1.22286
C  4.607612 0.226651 -1.213786
C  4.607398 0.233892 1.214217
C  6.858692 0.112013 0.000696
H  -1.119442 1.643619 -0.001351
H  -4.094067 -2.45501 0.00169
H  -5.876634 1.897137 0.918506
H  -5.876976 1.89594 -0.920698
H  0.73198 -1.641034 0.002162
H  -0.491064 -3.175185 0.000774
H  -2.113286 -3.802722 0.001886
H  2.647127 0.320916 -2.169336
H  2.646725 0.3339 2.16885
H  5.147895 0.209002 -2.168938
H  5.147511 0.221923 2.169546
H  7.290721 0.596201 0.894767
H  7.20338 -0.941061 -0.000785
H  7.291271 0.598791 -0.891733
